{"text_format":"1","workbook":"xlsx","n_sheets":4,"sheets":["要項","申込書","登録ナンバー","歴代入賞者"],"not_rendered":{"charts":0,"images":0,"macros":0,"external_links":0,"defined_names":0,"comments":0,"pivot_tables":0},"unopened":[],"bounds":{"document_bytes":16777216,"sheet_cells":100000,"rows_first":2000,"rows_last":500,"rows_between":2000,"halvings":0,"cell_chars":16384,"cell_head_chars":4096},"cells_cut":0,"cells_raw":0,"read":"whole","date_system":"1904"}

{"sheet":"要項","index":0,"n_rows":49,"n_cols":3,"rows_kept":49,"cut":false,"hidden":false,"merged":[[36,2,36,5],[37,2,37,5],[38,2,38,5],[39,2,39,5],[1,1,1,5],[35,1,35,5],[17,2,17,5],[19,2,20,5],[30,2,30,6],[31,2,31,6]]}
[]
[null,"第　21　回　東近江カップ　募集要項"]
[]
[null,"■期　　日　","２０２５年　７月　６日（日）※小雨決行"]
[]
[null,"■主　　催　","東近江市テニス協会（担当クラブ ：うさぎとかめの集い）"]
[]
[null,"■会　　場　","ひばり公園　6面 　 すこやかコート　2面"]
[]
[null,"■種　　目　","ミックスダブルス団体戦（３ペア/チーム）"]
[]
[null,null,"①一般の部"]
[null,null,"②ＯＶ350の部（2025年12月31日時点でのメンバー６人の合計年齢が350歳以上）"]
[]
[null,"■参加資格　　","オープン"]
[]
[null,"■チーム編成　","１チーム（男子3人・女子3人）"]
[null,null,"※１　メンバー構成は、同一クラブのチーム、他のクラブとの混成チーム、\n　　　一般の方との混成チームでも可能です。\n※２　協会登録クラブ名からのチーム名の変更も可能です。\n　　　　（ただし９文字以内で）  　　　　　"]
[]
[null,"■試合方法　","予選リーグ戦の後、順位決定トーナメント\n参加人数、天候等により、ゲーム数など決定させていただきます。\nなるべく沢山の試合数をこなして頂けるよう調整します。"]
[]
[]
[null,"■審　　判","セルフジャッジ"]
[]
[null,"■表　　彰　","１位T １～４位 / ２位T １位 / ３位T １位(チーム数により変更あり)"]
[]
[null,"■参　加　料　　","東近江市テニス協会協会員　1,000円/1名　一般　2,000円/1名"]
[null,null,"学生（高校生まで）　500円/1名"]
[null,null,"（当日払いは、　1名プラス100円）"]
[]
[null,"■申込方法\n　","１．ドロー会議でお申込み\n　　代表者が申込書および参加料を、下記日時のドロー会議へ持参下さい。"]
[null,null,"２．メール・振り込みでお申込み\n　　２０２５年６月２６日（木）までに参加費用のお振込みおよびメールで\n　　下記宛先に申込書を送付ください。"]
[]
[null,"■ドロー会議","日時：２０２５年６月２８日（土）１９：００～"]
[null,null,"会場：布引グリーンスタジアム内来賓室"]
[]
[null,"■申込先","■申し込み先   　 片岡一寿（うさかめ代表）"]
[null,null,"■連絡先　　　　　０９０－３０３８－３１３９"]
[null,null,"■メールアドレス　　ｐｔｋｑ６７１８０@ｙａｈｏｏ．cｏ．jｐ"]
[null,null,"■銀行口座　　　　ゆうちょ銀行　　14640-03483751 カタオカ　カズトシ　　"]
[]
[null,"■注意事項","1. 試合終了後　お互いの健闘を称えあいしっかりと「握手」をしてください"]
[null,null,"2. 試合中のミラーサングラス・フェイスマスクの使用は禁止です。"]
[null,null,"3. 試合審判は、セルフジャッジとなります。"]
[null,null,"4. 試合球は、ダンロップフォートを使用します。"]
[null,null,"5. 試合中の事故に関して東近江市テニス協会は一切責任を負いません。"]
[null,null,"6. 試合会場に各自で持ち込んだごみは持ち帰るようお願いします。"]
[null,null,"7. その他、試合前の説明事項を遵守ください。"]
[null,"　　　　　　　　　　"]

{"sheet":"申込書","index":1,"n_rows":53,"n_cols":7,"rows_kept":53,"cut":false,"hidden":false,"merged":[[25,1,25,2],[29,6,31,6],[32,1,34,1],[32,2,34,2],[32,3,34,3],[32,4,34,4],[32,5,34,5],[32,6,34,6],[29,1,31,1],[29,2,31,2],[29,3,31,3],[29,4,31,4],[29,5,31,5],[21,3,23,3],[21,4,23,4],[21,5,23,5],[21,6,23,6],[18,1,20,1],[18,2,20,2],[18,3,20,3],[18,4,20,4],[18,5,20,5],[0,1,0,5],[8,1,10,1],[8,2,10,2],[4,1,4,2],[8,3,10,3],[5,2,5,3],[8,4,10,4],[8,5,10,5],[40,6,42,6],[43,1,45,1],[43,2,45,2],[43,3,45,3],[43,4,45,4],[43,5,45,5],[43,6,45,6],[40,1,42,1],[40,2,42,2],[40,3,42,3],[40,4,42,4],[40,5,42,5],[37,2,37,3],[26,2,26,3],[15,2,15,3],[1,2,1,3],[3,0,3,6],[2,2,2,6],[11,1,13,1],[11,2,13,2],[11,4,13,4],[11,3,13,3],[8,6,10,6],[11,6,13,6],[11,5,13,5],[18,6,20,6],[21,1,23,1],[21,2,23,2],[49,5,49,6],[50,5,50,6],[51,5,51,6],[52,5,52,6],[48,5,48,6]]}
[null,"第２１回　東近江カップ　大会申込書"]
[null,"所属クラブ名",null,null,"代表者氏名"]
[null,"代表連絡先"]
["この登録したメンバー以外が試合に出る場合は変更をクラブ代表者から届けること。1人につき１０００円"]
[null,"一般の部"]
[null,"男子","チーム名（９文字以内）",null,"女子"]
[null,"登録ナンバー","氏　　名","年齢","登録ナンバー","氏　　名","年齢"]
[null,null,{"$f":"IF(B8=\"\",\"\",VLOOKUP(B8,登録ナンバー!$A$4:$G$292,7,0))","v":""},{"$f":"IF(C8=\"\",\"\",VLOOKUP(B8,登録ナンバー!$A$4:$L$292,11,0))","v":""},null,{"$f":"IF(E8=\"\",\"\",VLOOKUP(E8,登録ナンバー!$A$4:$G$292,7,0))","v":""},{"$f":"IF(F8=\"\",\"\",VLOOKUP(E8,登録ナンバー!$A$4:$L$292,11,0))","v":""}]
[null,null,{"$f":"IF(B9=\"\",\"\",VLOOKUP(B9,登録ナンバー!$A$4:$G$292,7,0))","v":""},{"$f":"IF(B9=\"\",\"\",VLOOKUP(B9,登録ナンバー!$A$4:$L$292,11,0))","v":""},null,{"$f":"IF(E9=\"\",\"\",VLOOKUP(E9,登録ナンバー!$A$4:$G$292,7,0))","v":""},{"$f":"IF(F9=\"\",\"\",VLOOKUP(E9,登録ナンバー!$A$4:$L$292,11,0))","v":""}]
[]
[]
[null,null,{"$f":"IF(B12=\"\",\"\",VLOOKUP(B12,登録ナンバー!$A$4:$G$292,7,0))","v":""},{"$f":"IF(B12=\"\",\"\",VLOOKUP(B12,登録ナンバー!$A$4:$L$292,11,0))","v":""},null,{"$f":"IF(E12=\"\",\"\",VLOOKUP(E12,登録ナンバー!$A$4:$G$292,7,0))","v":""},{"$f":"IF(F12=\"\",\"\",VLOOKUP(E12,登録ナンバー!$A$4:$L$292,11,0))","v":""}]
[]
[]
[]
[null,"男子","チーム名（９文字以内）",null,"女子"]
[null,"登録ナンバー","氏　　名","年齢","登録ナンバー","氏　　名","年齢"]
[null,null,{"$f":"IF(B18=\"\",\"\",VLOOKUP(B18,登録ナンバー!$A$4:$G$292,7,0))","v":""},{"$f":"IF(C18=\"\",\"\",VLOOKUP(B18,登録ナンバー!$A$4:$L$292,11,0))","v":""},null,{"$f":"IF(E18=\"\",\"\",VLOOKUP(E18,登録ナンバー!$A$4:$G$292,7,0))","v":""},{"$f":"IF(F18=\"\",\"\",VLOOKUP(E18,登録ナンバー!$A$4:$L$292,11,0))","v":""}]
[null,null,{"$f":"IF(B19=\"\",\"\",VLOOKUP(B19,登録ナンバー!$A$4:$G$292,7,0))","v":""},{"$f":"IF(B19=\"\",\"\",VLOOKUP(B19,登録ナンバー!$A$4:$L$292,11,0))","v":""},null,{"$f":"IF(E19=\"\",\"\",VLOOKUP(E19,登録ナンバー!$A$4:$G$292,7,0))","v":""},{"$f":"IF(F19=\"\",\"\",VLOOKUP(E19,登録ナンバー!$A$4:$L$292,11,0))","v":""}]
[]
[]
[null,null,{"$f":"IF(B22=\"\",\"\",VLOOKUP(B22,登録ナンバー!$A$4:$G$292,7,0))","v":""},{"$f":"IF(B22=\"\",\"\",VLOOKUP(B22,登録ナンバー!$A$4:$L$292,11,0))","v":""},null,{"$f":"IF(E22=\"\",\"\",VLOOKUP(E22,登録ナンバー!$A$4:$G$292,7,0))","v":""},{"$f":"IF(F22=\"\",\"\",VLOOKUP(E22,登録ナンバー!$A$4:$L$292,11,0))","v":""}]
[]
[]
[]
[null,"ＯＶ350の部"]
[null,"男子","チーム名（９文字以内）",null,"女子"]
[null,"登録ナンバー","氏　　名","年齢","登録ナンバー","氏　　名","年齢"]
[null,null,{"$f":"IF(B29=\"\",\"\",VLOOKUP(B29,登録ナンバー!$A$4:$G$292,7,0))","v":""},{"$f":"IF(C29=\"\",\"\",VLOOKUP(B29,登録ナンバー!$A$4:$L$292,11,0))","v":""},null,{"$f":"IF(E29=\"\",\"\",VLOOKUP(E29,登録ナンバー!$A$4:$G$292,7,0))","v":""},{"$f":"IF(F29=\"\",\"\",VLOOKUP(E29,登録ナンバー!$A$4:$L$292,11,0))","v":""}]
[null,null,{"$f":"IF(B30=\"\",\"\",VLOOKUP(B30,登録ナンバー!$A$4:$G$292,7,0))","v":""},{"$f":"IF(B30=\"\",\"\",VLOOKUP(B30,登録ナンバー!$A$4:$L$292,11,0))","v":""},null,{"$f":"IF(E30=\"\",\"\",VLOOKUP(E30,登録ナンバー!$A$4:$G$292,7,0))","v":""},{"$f":"IF(F30=\"\",\"\",VLOOKUP(E30,登録ナンバー!$A$4:$L$292,11,0))","v":""}]
[]
[]
[null,null,{"$f":"IF(B33=\"\",\"\",VLOOKUP(B33,登録ナンバー!$A$4:$G$292,7,0))","v":""},{"$f":"IF(B33=\"\",\"\",VLOOKUP(B33,登録ナンバー!$A$4:$L$292,11,0))","v":""},null,{"$f":"IF(E33=\"\",\"\",VLOOKUP(E33,登録ナンバー!$A$4:$G$292,7,0))","v":""},{"$f":"IF(F33=\"\",\"\",VLOOKUP(E33,登録ナンバー!$A$4:$L$292,11,0))","v":""}]
[]
[]
[null,null,"合計年齢",{"$f":"IF(B29=\"\",\"\",G29+G30+G33+D29+D30+D33)","v":""},null,"参加可否",{"$f":"IF(D36>=350,\"可\",\"不可\")","v":"可"}]
[]
[null,"男子","チーム名（９文字以内）",null,"女子"]
[null,"登録ナンバー","氏　　名","年齢","登録ナンバー","氏　　名","年齢"]
[null,null,{"$f":"IF(B40=\"\",\"\",VLOOKUP(B40,登録ナンバー!$A$4:$G$292,7,0))","v":""},{"$f":"IF(C40=\"\",\"\",VLOOKUP(B40,登録ナンバー!$A$4:$L$292,11,0))","v":""},null,{"$f":"IF(E40=\"\",\"\",VLOOKUP(E40,登録ナンバー!$A$4:$G$292,7,0))","v":""},{"$f":"IF(F40=\"\",\"\",VLOOKUP(E40,登録ナンバー!$A$4:$L$292,11,0))","v":""}]
[null,null,{"$f":"IF(B41=\"\",\"\",VLOOKUP(B41,登録ナンバー!$A$4:$G$292,7,0))","v":""},{"$f":"IF(B41=\"\",\"\",VLOOKUP(B41,登録ナンバー!$A$4:$L$292,11,0))","v":""},null,{"$f":"IF(E41=\"\",\"\",VLOOKUP(E41,登録ナンバー!$A$4:$G$292,7,0))","v":""},{"$f":"IF(F41=\"\",\"\",VLOOKUP(E41,登録ナンバー!$A$4:$L$292,11,0))","v":""}]
[]
[]
[null,null,{"$f":"IF(B44=\"\",\"\",VLOOKUP(B44,登録ナンバー!$A$4:$G$292,7,0))","v":""},{"$f":"IF(B44=\"\",\"\",VLOOKUP(B44,登録ナンバー!$A$4:$L$292,11,0))","v":""},null,{"$f":"IF(E44=\"\",\"\",VLOOKUP(E44,登録ナンバー!$A$4:$G$292,7,0))","v":""},{"$f":"IF(F44=\"\",\"\",VLOOKUP(E44,登録ナンバー!$A$4:$L$292,11,0))","v":""}]
[]
[]
[null,null,"合計年齢",{"$f":"IF(B40=\"\",\"\",G40+G41+G44+D40+D41+D44)","v":""},null,"参加可否",{"$f":"IF(D47>=350,\"可\",\"不可\")","v":"可"}]
[]
[null,null,"参加費",null,"人数","小計"]
[null,null,"協会員",1000,null,{"$f":"D50*E50","v":0}]
[null,null,"一般",2000,null,{"$f":"D51*E51","v":0}]
[null,null,"ジュニア",500,null,{"$f":"D52*E52","v":0}]
[null,null,null,null,"合計",{"$f":"SUM(F50:F52)","v":0}]

{"sheet":"登録ナンバー","index":2,"n_rows":291,"n_cols":13,"rows_kept":291,"cut":false,"hidden":false,"merged":[[0,1,1,7],[0,8,1,12]]}
[null,"２０２５年度東近江市テニス協会登録ナンバー",null,null,null,null,null,null,"2025.2.25"]
[]
[null,1]
["あ０１","青木","重之","アビック",null,{"$f":"A4","v":"あ０１"},{"$f":"B4&C4","v":"青木重之"},"アビックBB","男",1971,{"$f":"IF(J4=\"\",\"\",(2025-J4))","v":54},{"$f":"IF(G4=\"\",\"\",IF(COUNTIF($G$4:$G$294,G4)>1,\"2重登録\",\"OK\"))","v":"OK"},"草津市"]
["あ０２","西川","昌一","アビック",null,{"$f":"A5","v":"あ０２"},"西川昌一","アビックBB","男",1970,{"$f":"IF(J5=\"\",\"\",(2025-J5))","v":55},"OK","彦根市"]
["あ０３","安達","隆一","アビック",null,{"$f":"A6","v":"あ０３"},"安達隆一","アビックBB","男",1970,55,"OK","甲賀市"]
["あ０４","上原","義弘","アビック",null,{"$f":"A7","v":"あ０４"},"上原義弘","アビックBB","男",1974,51,"OK","彦根市"]
["あ０５","寺村","浩一","アビック",null,{"$f":"A8","v":"あ０５"},"寺村浩一","アビックBB","男",1968,57,"OK","愛荘町"]
["あ０６","谷崎","真也","アビック",null,{"$f":"A9","v":"あ０６"},"谷崎真也","アビックBB","男",1972,{"$f":"IF(J9=\"\",\"\",(2025-J9))","v":53},"OK","甲賀市"]
["あ０７","齋田","優子","アビック",null,"あ０７","齋田優子","アビックBB","女",1970,55,"OK","彦根市"]
["あ０８","平居","崇","アビック",null,"あ０８","平居崇","アビックBB","男",1972,53,"OK","多賀町"]
["あ０９","大林","弘典","アビック",null,"あ０９","大林弘典","アビックBB","男",1989,36,"OK","長浜市"]
["あ１０","福嶋","亮","アビック",null,"あ１０","福嶋亮","アビックBB","男",1961,64,"OK","養老町"]
["あ１１","三原","啓子","アビック",null,"あ１１","三原啓子","アビックBB","女",1964,{"$f":"IF(J14=\"\",\"\",(2025-J14))","v":61},"OK","彦根市"]
["あ１２","落合","良弘","アビック",null,"あ１２","落合良弘","アビックBB","男",1968,57,"OK","長浜市"]
["あ１３","松井","傳樹 ","アビック",null,"あ１３","松井傳樹 ","アビックBB","男",1987,38,"OK","彦根市"]
["あ１４","中村","紗映子","アビック",null,"あ１４","中村紗映子","アビックBB","女",1983,42,"OK","長浜市"]
["あ１５","長谷川","優","アビック",null,"あ１５","長谷川優","アビックBB","男",1973,52,"OK","甲賀市"]
["あ１６","成宮","まき","アビック",null,"あ１６","成宮まき","アビックBB","女",1970,55,"OK","彦根市"]
["あ１７","松本","光美","アビック",null,"あ１７","松本光美","アビックBB","女",1971,54,"OK","草津市"]
["あ１８","草野","活地","アビック",null,"あ１８","草野活地","アビックBB","男",1974,51,"OK","草津市"]
["あ１９","吉川","孝次","アビック",null,"あ１９","吉川孝次","アビックBB","男",1976,49,"OK","彦根市"]
["あ２０","姫田","和憲","アビック",null,"あ２０","姫田和憲","アビックBB","男",1984,41,"OK","京都市"]
["あ２１","堅田","瑞木","アビック",null,"あ２１","堅田瑞木","アビックBB","女",1996,29,"OK","京都市"]
["あ２２","堀田","明子","アビック",null,"あ２２","堀田明子","アビックBB","女",1970,55,"OK","東近江市"]
["あ２３","法戸","義也","アビック",null,"あ２３","法戸義也","アビックBB","男",1983,42,"OK","米原市"]
["あ２４","佐野","直美","アビック",null,"あ２４","佐野直美","アビックBB","女",1975,50,"OK","京都市"]
["あ２５","千代","美由紀","アビック",null,"あ２５","千代美由紀","アビックBB","女",1972,53,"OK","栗東市"]
["あ２６","小西","由美子","アビック",null,"あ２６","小西由美子","アビックBB","女",1968,57,"OK","近江八幡市"]
["あ２７","徳田","裕子","アビック",null,"あ２７","徳田裕子","アビックBB","女",1971,54,"OK","近江八幡市"]
["あ２８","叶丸","利恵子","アビック",null,"あ２８","叶丸利恵子","アビックBB","女",1965,60,"OK","草津市"]
["あ２９","脇田","里加","アビック",null,"あ２９","脇田里加","アビックBB","女",1963,62,"OK","草津市"]
["あ３０","冨岡","浩史","アビック",null,"あ３０","冨岡浩史","アビックBB","男",1967,58,"OK","草津市"]
["あ３１","西堀","公人","アビック",null,"あ３１","西堀公人","アビックBB","男",1984,41,"OK","近江八幡市"]
["あ３２","清野","宏樹","アビック",null,"あ３２","清野宏樹","アビックBB","男",1987,38,"OK","京都市"]
["あ３３","宇野","泰三","アビック",null,"あ３３","宇野泰三","アビックBB","女",1974,51,"OK","野洲市"]
["あ３４","中澤","由香","アビック",null,"あ３４","中澤由香","アビックBB","男",1975,50,"OK","草津市"]
["あ３５","坪井","徳寿","アビック",null,"あ３５","坪井徳寿","アビックBB","男",1979,46,"OK","草津市"]
["あ３６","山中","博子","アビック",null,"あ３６","山中博子","アビックBB","女",1970,55,"OK","野洲市"]
[null,2]
["あぷ０１","杉山","邦夫","アプストTC","ｓｅ",{"$f":"A41","v":"あぷ０１"},{"$f":"B41&C41","v":"杉山邦夫"},"アプストTC","男",1950,{"$f":"IF(J41=\"\",\"\",(2025-J41))","v":75},{"$f":"IF(G41=\"\",\"\",IF(COUNTIF($G$4:$G$319,G41)>1,\"2重登録\",\"OK\"))","v":"OK"},"犬上郡"]
["あぷ０２","川上","英二","アプストTC",null,{"$f":"A42","v":"あぷ０２"},"川上英二","アプストTC","男",1963,{"$f":"IF(J42=\"\",\"\",(2025-J42))","v":62},"OK","東近江市"]
["あぷ０３","浅田","隆昭","アプストTC",null,{"$f":"A43","v":"あぷ０３"},"浅田隆昭","アプストTC","男",1964,61,"OK","守山市"]
["あぷ０４","森永","洋介","アプストTC",null,{"$f":"A44","v":"あぷ０４"},"森永洋介","アプストTC","男",1986,39,"OK","近江八幡市"]
["あぷ０５","辰巳","悟朗","アプストTC",null,{"$f":"A45","v":"あぷ０５"},"辰巳悟朗","アプストTC","男",1974,51,"OK","彦根市"]
["あぷ０６","川上","美弥子","アプストTC",null,{"$f":"A46","v":"あぷ０６"},"川上美弥子","アプストTC","女",1971,{"$f":"IF(J46=\"\",\"\",(2025-J46))","v":54},"OK","東近江市"]
["あぷ０７","山内","雄平","アプストTC",null,"あぷ０７","山内雄平","アプストTC","男",1989,36,"OK","東近江市"]
["あぷ０８","木村","美香","アプストTC",null,"あぷ０８","木村美香","アプストTC","女",1962,63,"OK","米原市"]
["あぷ０９","梶木","和子","アプストTC",null,"あぷ０９","梶木和子","アプストTC","女",1960,65,"OK","彦根市"]
["あぷ１０","日高","眞規子","アプストTC",null,"あぷ１０","日高眞規子","アプストTC","女",1963,62,"OK","長浜市"]
["あぷ１１","長谷出","浩","アプストTC",null,"あぷ１１","長谷出浩","アプストTC","男",1960,{"$f":"IF(J51=\"\",\"\",(2025-J51))","v":65},"OK","東近江市"]
["あぷ１２","奥田","純也","アプストTC",null,"あぷ１２","奥田純也","アプストTC","男",1963,62,"OK","東近江市"]
["あぷ１３","村田","朋子","アプストTC",null,"あぷ１３","村田朋子","アプストTC","女",1959,66,"OK","東近江市"]
["あぷ１４","村田","理恵子","アプストTC",null,"あぷ１４","村田理恵子","アプストTC","女",1979,46,"OK","東近江市"]
["あぷ１５","東","正隆","アプストTC",null,"あぷ１５","東正隆","アプストTC","男",1965,60,"OK","彦根市"]
["あぷ１６","二ツ井","裕也","アプストTC",null,"あぷ１６","二ツ井裕也","アプストTC","男",1990,35,"OK","京都府"]
["あぷ１７","田中　","有紀","アプストTC",null,"あぷ１７","田中　有紀","アプストTC","女",1969,56,"OK","蒲生郡"]
["あぷ１８","岡川","謙二","アプストTC",null,"あぷ１８","岡川謙二","アプストTC","男",1967,58,"OK","近江八幡市"]
["あぷ１９","稲泉","聡","アプストTC",null,"あぷ１９","稲泉聡","アプストTC","男",1967,58,"OK","近江八幡市"]
["あぷ２０","妹川","寿明","アプストTC",null,"あぷ２０","妹川寿明","アプストTC","男",1995,30,"OK","東近江市"]
["あぷ２１","妹川","麻佑","アプストTC",null,"あぷ２１","妹川麻佑","アプストTC","女",1995,30,"OK","東近江市"]
["あぷ２２","永松","貴子","アプストTC",null,"あぷ２２","永松貴子","アプストTC","女",1962,63,"OK","彦根市"]
["あぷ２３","藤原","泰子","アプストTC",null,"あぷ２３","藤原泰子","アプストTC","女",1965,60,"OK","守山市"]
["あぷ２４","敦賀","創一","アプストTC",null,"あぷ２４","敦賀創一","アプストTC","男",1998,27,"OK","彦根市"]
["あぷ２５","有吉","裕喜","アプストTC",null,"あぷ２５","有吉裕喜","アプストTC","男",1973,52,"OK","湖南市"]
["あぷ２６","松原","礼","アプストTC",null,"あぷ２６","松原礼","アプストTC","男",1987,38,"OK","東近江市"]
["あぷ２７","福岡","由布加","アプストTC",null,"あぷ２７","福岡由布加","アプストTC","女",1999,26,"OK","東近江市"]
[null,3]
["あん０１","池田","枝里","アンヴァース",null,{"$f":"A69","v":"あん０１"},{"$f":"B69&C69","v":"池田枝里"},"アンヴァース","女",1986,{"$f":"IF(J69=\"\",\"\",(2025-J69))","v":39},{"$f":"IF(G69=\"\",\"\",IF(COUNTIF($G$7:$G$347,G69)>1,\"2重登録\",\"OK\"))","v":"OK"},"彦根市"]
["あん０２","植田","早耶","アンヴァース",null,{"$f":"A70","v":"あん０２"},{"$f":"B70&C70","v":"植田早耶"},"アンヴァース","女",1999,{"$f":"IF(J70=\"\",\"\",(2025-J70))","v":26},"OK","東近江市"]
["あん０３","山口","千恵","アンヴァース",null,{"$f":"A71","v":"あん０３"},{"$f":"B71&C71","v":"山口千恵"},"アンヴァース","女",1979,46,"OK","守山市"]
["あん０４","森","心奈","アンヴァース",null,"あん０４","森心奈","アンヴァース","女",2013,12,"OK","栗東市"]
["あん０５","脇坂","愛里","アンヴァース",null,"あん０５","脇坂愛里","アンヴァース","女",1989,36,"OK","彦根市"]
["あん０６","上津","慶和","アンヴァース",null,"あん０６","上津慶和","アンヴァース","男",1993,32,"OK","大津市"]
["あん０７","脇坂","和樹","アンヴァース",null,"あん０７","脇坂和樹","アンヴァース","男",1992,33,"OK","彦根市"]
["あん０８","小田","紀彦","アンヴァース",null,"あん０８","小田紀彦","アンヴァース","男",1984,41,"OK","野洲市"]
["あん０９","越智","友基","アンヴァース",null,"あん０９","越智友基","アンヴァース","男",1987,38,"OK","野洲市"]
["あん１０","辻本","将士","アンヴァース",null,"あん１０","辻本将士","アンヴァース","男",1986,39,"OK","東近江市"]
["あん１１","津曲","崇志","アンヴァース",null,"あん１１","津曲崇志","アンヴァース","男",1989,36,"OK","湖南市"]
["あん１２","鍋内","雄樹","アンヴァース",null,"あん１２","鍋内雄樹","アンヴァース","男",1990,35,"OK","蒲生郡"]
["あん１３","桐原","昇汰","アンヴァース",null,"あん１３","桐原昇汰","アンヴァース","男",1994,31,"OK","守山市"]
["あん１４","松村","友喜","アンヴァース",null,"あん１４","松村友喜","アンヴァース","男",1988,37,"OK","彦根市"]
["あん１５","薮内","豪","アンヴァース",null,"あん１５","薮内豪","アンヴァース","男",1986,39,"OK","長浜市"]
["あん１６","森","寿人","アンヴァース",null,"あん１６","森寿人","アンヴァース","男",1978,47,"OK","栗東市"]
["あん１７","山田","佳明","アンヴァース",null,"あん１７","山田佳明","アンヴァース","男",1986,39,"OK","彦根市"]
["あん１８","愛原","里樹","アンヴァース",null,"あん１８","愛原里樹","アンヴァース","男",1995,30,"OK","大津市"]
["あん１９","岡田","真樹","アンヴァース",null,"あん１９","岡田真樹","アンヴァース","男",1982,43,"OK","草津市"]
["あん２０","鈴木","悠太","アンヴァース",null,"あん２０","鈴木悠太","アンヴァース","男",2000,25,"OK","草津市"]
["あん２１","政田","秀栄","アンヴァース",null,"あん２１","政田秀栄","アンヴァース","男",1982,43,"OK","栗東市"]
["あん２２","猪飼","尚輝","アンヴァース",null,"あん２２","猪飼尚輝","アンヴァース","男",1996,29,"OK","栗東市"]
["あん２３","岡","栄介","アンヴァース",null,"あん２３","岡栄介","アンヴァース","男",1996,29,"OK","栗東市"]
["あん２４","寺元","翔太","アンヴァース",null,"あん２４","寺元翔太","アンヴァース","男",1993,32,"OK","長浜市"]
["あん２５","三箇","将士","アンヴァース",null,"あん２５","三箇将士","アンヴァース","男",1994,31,"OK","長浜市"]
["あん２６","澤田","純兵","アンヴァース",null,"あん２６","澤田純兵","アンヴァース","男",1997,28,"OK","長浜市"]
[null,4]
["け０１","稲岡","和紀","Kテニス",null,"け０１","稲岡和紀","Ｋテニスカレッジ","男",1978,{"$f":"IF(J96=\"\",\"\",(2025-J96))","v":47},{"$f":"IF(H96=\"\",\"\",IF(COUNTIF($G$4:$G$21,H96)>1,\"2重登録\",\"OK\"))","v":"OK"},"東近江市"]
["け０２","上村","　武","Kテニス",null,"け０２","上村　武","Ｋテニスカレッジ","男",1978,{"$f":"IF(J97=\"\",\"\",(2025-J97))","v":47},"OK","彦根市"]
["け０３","川上","悠作","Kテニス",null,"け０３","川上悠作","Ｋテニスカレッジ","男",2000,25,"OK","東近江市"]
["け０４","川並","和之","Kテニス",null,"け０４","川並和之","Ｋテニスカレッジ","男",1959,66,"OK","東近江市"]
["け０５","坪田","真嘉","Kテニス",null,"け０５","坪田真嘉","Ｋテニスカレッジ","男",1976,49,"OK","東近江市"]
["け０７","永里","裕次","Kテニス",null,"け０７","永里裕次","Ｋテニスカレッジ","男",1979,46,"OK","三重県"]
["け０８","山口","直彦","Kテニス",null,"け０８","山口直彦","Ｋテニスカレッジ","男",1986,39,"OK","東近江市"]
["け０９","福永","裕美","Kテニス",null,"け０９","福永裕美","Ｋテニスカレッジ","女",1963,62,"OK","東近江市"]
["け１０","福永","一典","Kテニス",null,"け１０","福永一典","Ｋテニスカレッジ","男",1967,58,"OK","近江八幡市"]
["け１１","小澤","藤信","Kテニス",null,"け１１","小澤藤信","Ｋテニスカレッジ","男",1964,61,"OK","彦根市"]
["け１２","疋田","之宏","Kテニス",null,"け１２","疋田之宏","Ｋテニスカレッジ","男",1960,65,"OK","東近江市"]
["け１３","朝日","尚紀","Kテニス",null,"け１３","朝日尚紀","Ｋテニスカレッジ","男",1983,42,{"$f":"IF(H107=\"\",\"\",IF(COUNTIF($G$4:$G$142,H107)>1,\"2重登録\",\"OK\"))","v":"OK"},"三重県"]
["け１４","朝日","智美","Kテニス",null,"け１４","朝日智美","Ｋテニスカレッジ","女",1983,42,{"$f":"IF(H108=\"\",\"\",IF(COUNTIF($G$4:$G$21,H108)>1,\"2重登録\",\"OK\"))","v":"OK"},"三重県"]
["け１５","本多","勇輝","Kテニス",null,"け１５","本多勇輝","Ｋテニスカレッジ","男",1989,36,"OK","守山市"]
["け１６","堤","泰彦","Kテニス",null,"け１６","堤泰彦","Ｋテニスカレッジ","男",1987,38,"OK","東近江市"]
["け１７","新谷","良","Kテニス",null,"け１７","新谷良","Ｋテニスカレッジ","男",1984,41,"OK","湖南市"]
["け１８","川上","駿亮","Kテニス",null,"け１８","川上駿亮","Ｋテニスカレッジ","男",1997,28,"OK","東近江市"]
["け１９","山口","真彦","Kテニス",null,{"$f":"A114","v":"け２０"},"山口真彦","Ｋテニスカレッジ","男",1991,34,"OK","近江八幡市"]
["け２０","西田","和教","Kテニス",null,{"$f":"A115","v":"け２１"},"西田和教","Ｋテニスカレッジ","男",1966,59,"OK","彦根市"]
["け２１","上村","悠大","Kテニス",null,{"$f":"A115","v":"け２１"},"上村悠大","Ｋテニスカレッジ","男",2001,24,"OK","彦根市"]
["け２２","森","彩","Kテニス",null,"け２２","森彩","Ｋテニスカレッジ","女",1977,48,"OK","近江八幡市"]
[null,5]
["き０１","赤木","拓","京セラTC",null,{"$f":"A118","v":"き０１"},"赤木拓","京セラTC","男",1980,{"$f":"IF(J118=\"\",\"\",(2025-J118))","v":45},{"$f":"IF(H118=\"\",\"\",IF(COUNTIF($G$4:$G$21,H118)>1,\"2重登録\",\"OK\"))","v":"OK"},"近江八幡市"]
["き０２","荒浪","順次","京セラTC",null,{"$f":"A119","v":"き０２"},"荒浪順次","京セラTC","男",1977,{"$f":"IF(J119=\"\",\"\",(2025-J119))","v":48},{"$f":"IF(H119=\"\",\"\",IF(COUNTIF($G$4:$G$21,H119)>1,\"2重登録\",\"OK\"))","v":"OK"},"大津市"]
["き０３","井澤　","匡志","京セラTC",null,{"$f":"A120","v":"き０３"},"井澤　匡志","京セラTC","男",1967,58,{"$f":"IF(H120=\"\",\"\",IF(COUNTIF($G$4:$G$21,H120)>1,\"2重登録\",\"OK\"))","v":"OK"},"東近江市"]
{"$rows_left_out":172}
{"sheet":"歴代入賞者","index":3,"n_rows":49,"n_cols":27,"rows_kept":49,"cut":false,"hidden":false,"merged":[[0,1,0,15]]}
[null,"東近江カップ歴代成績"]
[]
[null,null,"東近江市","東近江市","東近江市","東近江市","東近江市","東近江市","東近江市","東近江市","東近江市","東近江市","東近江市第１０回","東近江市","東近江市","東近江市","東近江市","東近江市","東近江市","東近江市","東近江市","東近江市","八日市市","八日市市","八日市市","八日市市","八日市市"]
[null,null,"第20回大会2023年","第19回大会2023年","第18回大会2022年","第17回大会2021年","第16回大会2020年","第15回大会2019年","第14回大会2018年","第13回大会2017年","第12回大会2016年","第11回大会2015年","記念大会2014年","第9回大会2013年","第８回大会2012年","第7回大会2011年","第６回大会2010年","第５回大会2009年","第４回大会2008年","第３回大会2007年","第2回大会2006年","第１回大会2005年","第５回大会2004年","第４回大会2003年","第3回大会2002年","第2回大会2001年","第１回大会2000年"]
[null,null,"2024.7.7","2023.7.9","2022.7.10","2021.7.7",null,null,"2018.7.8","2017.7.9","2016.7.10","2015.7.12","2014.7.13","2013.7.21","2012.7.1","2011.7.3","2010.7.4","2009.7.5","2008.6.28"]
[null,"優勝","うさかめ（強）","うさかめクロス","うさかめクロス","MTT",null,null,"チームＪＵＮＫＯ","チームＪＵＮＫＯ","チーム　ゆとり","グリフィンズＡ","ふれふれ坊主","ＫテニスカレッジＡ","ＫテニスカレッジＡ","ＫテニスカレッジＡ","ＫテニスカレッジＡ","錦","ＫテニスカレッジＡ","錦","錦","イナマーズ","イナマーズ","ＫテニスカレッジＡ","ＫテニスカレッジＡ","いい夫婦友の会","村田製作所連合軍"]
[null,null,"林哲学","竹田　圭佑","竹田　圭佑","吉野　淳也",null,null,"藤井正和","藤井正和","吉野　淳也","北村　健","三代　康成","川並　和之","川並　和之","川並　和之","川並　和之","中田　冨憲","川並　和之","中田　冨憲","中田　冨憲","川上　英二","稲泉　聡","川並　和之","　永里　裕次","青井　　亘","名田　一茂"]
[null,null,"小林一成","松本啓吾","松本啓吾","本多　勇輝",null,null,"武藤幸宏","武藤幸宏","岩渕　光紀","岡本大樹","辻　義規","山口　真彦","山口　真彦","山口　真彦","山口　直彦","川上　英二","坪田　真嘉","池端　誠治","池端　誠治","稲泉　聡","川上　英二","高瀬　英彦","　植松　靖之","岡川　謙二","岡川　謙二"]
[null,null,"井口瑛心","川上悠作","新谷　良","新谷　良","コロナのため中止","コロナのため中止","小出周平","小出周平","浅田恵壱","浦崎康平","成宮　康弘","坪田　真嘉","坪田　真嘉","坪田　真嘉","坪田　真嘉","稲泉　聡","村地　直也","川上　英二","川上　英二","川本　純也","澤村　博司","山口　直彦","　山口　直彦","名田　一茂","甲斐下　仁平"]
[null,null,"中村香澄","山田雅子","大野　美南","池尻　陽香",null,null,"岩崎順子","岩崎順子","國近なつ美","福島麻公","三代　梨絵","田中　和枝","田中　和枝","田中　和枝","田中　和枝","入江　晶子","田中　和枝","白根　和栄　","田中　都","今井　順子","今井　順子","田中　和枝","　高田貴代美","青井美恵子","名田　育子"]
[null,null,"佐口珠穂","山田歩奈","山田歩奈","松村　明香",null,null,"和田桃子","和田桃子","小倉　菜奈","寒出麻奈未","土肥　祐子","石原　はる美","石原　はる美","石原　はる美","石原　はる美","松田 順子","石原　はる美","入江　晶子","入江　晶子","入江　晶子","田中　一美","　高田　貴代美","　村田　由子","岡川　恭子","岡川　恭子"]
[null,null,"山田歩奈","浅野木奈子","高野麻由","山脇　聖菜",null,null,"藤岡美智子","藤岡美智子","津田悠花","三崎真依","近藤　直美","　永松　貴子","浅野木奈子","　永松　貴子","　永松　貴子","今井　順子","　近藤　直美","今井　順子","今井　順子","中村　晃代","佐藤　由美子","松山　遥","　近藤　直美","名田　育子","甲斐下　治美"]
[null,"準優勝","よせあつめ","アンヴァース","UP STAR☆","うさかめクロス",null,null,"しおんとクワガタ","ＫテニスカレッジＳ","グリフィンズＡ","チーム　ユトリ","ドラゴンレッド","Ｋテニスカレッジα","ひろみんず","Bambi","錦","Ｋテニスカレッジ","錦","ＫテニスカレッジＡ","ＫテニスカレッジＡ","ＫテニスカレッジＡ","ＫテニスカレッジＡ","夫婦Ｄｅテニス","チームＬＩＮＥＳ","安土ＴＣ.１","今井チーム"]
[null,null,"吉野淳也","上津慶和","辻雅晃","林　哲学",null,null,"西口正剛","吉野　淳也","北村　健","吉野　純也","中田　冨憲","山口直彦","浅田　洋史","三代　康成","稲泉　聡","川並　和之","中田　冨憲","川並　和之","川並　和之","川並　和之","川並　和之","　青井　　亘","　竹村　　治","大林　　久","大林　久"]
[null,null,"祝出優介","松村友喜","天井正","牛道　雄介",null,null,"今津大二郎","岩渕　光紀","井ノ口幹也","岩渕　光紀","川上　英二","永里祐次","小菅　真一","辻　義規","中田　冨憲","坪田　真嘉","佐藤　和弘","坪田　真嘉","坪田　真嘉","坪田　真嘉","高瀬　英彦","　岡川　謙二","　中村　隆昭","藤田　　論","鈴木　英夫"]
[null,null,"吉村優","寺元翔太","中村亘","竹田　圭佑","コロナのため中止","コロナのため中止","山形祐樹","中西泰輝","遠池建介","浅田洋史","西内　友也","竹村　治","辻　義規","山崎　正雄","佐藤　和弘","村地　直也","西内　友也","宮村　知宏","難波　道弘","竹村　治","長谷出　浩","　名田　一茂","　山口信一郎","塩田　浩二","寺田　昌登"]
[null,null,"漆原友里","片桐美里","野村香織","永松　貴子",null,null,"真田千春","東　恵","山本あづさ","稲継　馨","田中　由紀","山口美由希","伊吹　邦子","三代　梨絵","今井　順子","田中　和枝","白根　和栄　","田中　和枝","田中　和枝","近藤　直美","河口　佳代子","　青井美恵子","　甲斐　好美","今井　順子","今井　順子"]
[null,null,"村上陽香","植田早耶","齋藤好見","岡野　羽",null,null,"吉田恵里","田中瑞萌","佐々木恵子","小倉　菜奈","中村　晃代","川端文子","藤田　博美","土肥　祐子","松田 順子","石原　はる美","松田　順子","近藤　直美","石原　はる美","田中　和枝","　高田　貴代美","日比　正子","　山根　孝恵","小財","塩田　佳子"]
[null,null,"平山亜紀","西野美恵","天井真未","大野　美南",null,null,"浜口彩加","中島嬉子","福島麻公","迫田　成美","今井　順子","酒井直美","三崎　真依","金沢　優子","浅田　祥子","　梶木　和子","今井　順子","児玉　朋子","松山　遥","石原　はる美","近藤　直美","　名田　育子","　仙波佳代子","平野志津子","早川　多喜子"]
[null,"３位","ジャスティス山形","スパイシーズ","うさぎとかめの集い","グリフィンズ",null,null,"ふれふれ坊主","チームなかた","チームＪＵＮＫＯ","ＫテニスカレッジＡ","ＫテニスカレッジＡ","グリフィンズＡ","コリラックマ","ひろみんず","ＫテニスカレッジB","マリナーズ","ＫテニスカレッジB","ひこニャンズ","ひろみんズ","ＪＡＣＫ＆Ｂｅｔｔｙ","ＫテニスカレッジＢ","イナマーズ","夫婦Ｄｅテニス","ＫテニスカレッジＡ","愛知郡ＴＣＢ"]
[null,null,"吉田正剛","清野宏樹","山本浩之","漆原　大介",null,null,"三代康成","中田富憲","藤井正和","川並　和之","川並　和之","北村　健","古市　卓志","佐野　望","水本　敦史","内田　亮","小笠原　光雄","辻　義規","馬場　昭真","　青井　　亘","坂元　智成","稲泉　聡","　青井　　亘","川並　和之","関　弘次"]
[null,null,"木本和寿","本田賢二郎","稲葉大知","鍵谷　浩太",null,null,"金谷太郎","久保暉暉","武藤幸宏","永里　裕次","永里　裕次","岡本大樹","西川　昌一","小菅　真一","宮嶋　利弘","小菅　真一","宮嶋　利弘","古市　卓志","小菅　真一","杉山 邦夫","多田　章三","川上　英二","　岡川　謙二","多田　章三","山川　利章"]
[null,null,"山形祐樹","福島悠太","伊串大介","上津　慶和","コロナのため中止","コロナのため中止","成宮康弘","諌山航平","小出周平","山口　直彦","坪田　真嘉","浦崎康平","松本　啓吾","岡本　大樹","村地　直也","井ノ口　尚人","宮村　知宏","高瀬　英彦","荻野　義之","　岡川　謙二","坪田　真嘉","杉本　龍平","　名田　一茂","坪田　真嘉","清水　英秦"]
[null,null,"吉田恵里","堅田端木","藤田博美","漆原　友里",null,null,"三代梨絵","今井順子","岩崎順子","田中　和枝","田中　和枝","福島麻公","藤原　泰子","伊吹　邦子","浅田　亜祐子","藤田　博美","小笠原　容子","川端　文子","折岡　育子","　青井美恵子","小笠原　容子","湊","　青井美恵子","田中　和枝","飯尾　貴子"]
[null,null,"真田千春","真継早紀子","牛道心","植田　早耶",null,null,"木村美香","日高眞規子","森田千暁","　永松　貴子","石原　はる美","寒出麻奈未","木村　美香","藤田　博美","梶木　和子","橋本　真理","吉岡　京子","藤原　泰子","藤田　博美","　名田　育子","伊勢加奈子","大橋","　岡川　恭子","高田貴代美","甲斐　好美"]
[null,null,"梅田ひかり","佐藤彩香","村木貴子","鍵弥　初美",null,null,"筒井珠世","河野由子","藤岡美智子","山口美由希","　永松　貴子","三崎真依","佐竹　昌子","三崎　真依","伊吹　邦子","野村　良美","児玉　朋子","佐竹　昌子","金沢　優子","　岡川　恭子","石原　はる美","田中　一美","　名田　育子","村田　由子","中村　恭子"]
[]
[null,null,"ＯＶ３５０","ＯＶ３３０","OV３００","OV３００"]
[null,"優勝","ゴローズ","ペガサス","グリーンアップル","グリーンアップル"]
[null,null,"杉山邦夫","平塚聡","池端誠治","三代　康成"]
[null,null,"中田富憲","川上英二","成宮　康弘","成宮　康弘"]
[null,null,"辰巳悟朗","成宮康弘","古市　卓志","古市　卓志"]
[null,null,"永松貴子","筒井珠世","三代　梨絵","三代　梨絵"]
[null,null,"田中有紀","辻佳子","筒井　珠世","筒井　珠世"]
[null,null,"川上美弥子","竹下光代","土肥　裕子","土肥　裕子"]
[null,"準優勝","NEXT","ゴローズ","エール","NEXT"]
[null,null,"森寿人","東正隆","三代　康成","山田広美"]
[null,null,"福元公道","辰巳悟朗","水元淳史","山本　浩之"]
[null,null,"山田広実","木村喜和","辻義規","森　寿人"]
[null,null,"山口千恵","永松貴子","伊吹邦子","山口　登紀子"]
[null,null,"福元さち","川上美弥子","辻佳子","黒坂　晶子"]
[null,null,"谷口敬子","山田美樹","竹下光代","山口　千恵"]
[null,"３位","フレンズプラス","ワッキーズ","NEXT","クリティカルヒット"]
[null,null,"水本淳史","脇野佳邦","山田広美","杉山　邦夫"]
[null,null,"成宮康弘","岡本洋一","牛道雄介","辻　義規"]
[null,null,"馬場康弘","鈴木英夫","森　寿人","水元　淳史"]
[null,null,"筒井珠世","伊吹邦子","山口　登紀子","田中　有紀"]
[null,null,"出縄久子","松井美和子","黒坂　晶子","竹下　光代"]
[null,null,"藤原泰子","本池清子","山口　千恵","辻　佳子"]