{"text_format":"1","workbook":"xlsx","n_sheets":4,"sheets":["要項","申込書","登録ナンバー","歴代入賞者"],"not_rendered":{"charts":0,"images":0,"macros":0,"external_links":0,"defined_names":0,"comments":0,"pivot_tables":0},"unopened":[],"bounds":{"document_bytes":16777216,"sheet_cells":100000,"rows_first":2000,"rows_last":500,"rows_between":2000,"halvings":0,"cell_chars":16384,"cell_head_chars":4096},"cells_cut":0,"cells_raw":0,"read":"whole","date_system":"1904"}

{"sheet":"要項","index":0,"n_rows":49,"n_cols":3,"rows_kept":49,"cut":false,"hidden":false,"merged":[[36,2,36,5],[37,2,37,5],[38,2,38,5],[39,2,39,5],[1,1,1,5],[35,1,35,5],[17,2,17,5],[19,2,20,5],[30,2,30,6],[31,2,31,6]]}
[]
[null,"第　21　回　東近江カップ　募集要項"]
[]
[null,"■期　　日　","２０２５年　７月　６日（日）※小雨決行"]
[]
[null,"■主　　催　","東近江市テニス協会（担当クラブ ：うさぎとかめの集い）"]
[]
[null,"■会　　場　","ひばり公園　6面 　 すこやかコート　2面"]
[]
[null,"■種　　目　","ミックスダブルス団体戦（３ペア/チーム）"]
[]
[null,null,"①一般の部"]
[null,null,"②ＯＶ350の部（2025年12月31日時点でのメンバー６人の合計年齢が350歳以上）"]
[]
[null,"■参加資格　　","オープン"]
[]
[null,"■チーム編成　","１チーム（男子3人・女子3人）"]
[null,null,"※１　メンバー構成は、同一クラブのチーム、他のクラブとの混成チーム、\n　　　一般の方との混成チームでも可能です。\n※２　協会登録クラブ名からのチーム名の変更も可能です。\n　　　　（ただし９文字以内で）  　　　　　"]
[]
[null,"■試合方法　","予選リーグ戦の後、順位決定トーナメント\n参加人数、天候等により、ゲーム数など決定させていただきます。\nなるべく沢山の試合数をこなして頂けるよう調整します。"]
[]
[]
[null,"■審　　判","セルフジャッジ"]
[]
[null,"■表　　彰　","１位T １～４位 / ２位T １位 / ３位T １位(チーム数により変更あり)"]
[]
[null,"■参　加　料　　","東近江市テニス協会協会員　1,000円/1名　一般　2,000円/1名"]
[null,null,"学生（高校生まで）　500円/1名"]
[null,null,"（当日払いは、　1名プラス100円）"]
[]
[null,"■申込方法\n　","１．ドロー会議でお申込み\n　　代表者が申込書および参加料を、下記日時のドロー会議へ持参下さい。"]
[null,null,"２．メール・振り込みでお申込み\n　　２０２５年６月２６日（木）までに参加費用のお振込みおよびメールで\n　　下記宛先に申込書を送付ください。"]
[]
[null,"■ドロー会議","日時：２０２５年６月２８日（土）１９：００～"]
[null,null,"会場：布引グリーンスタジアム内来賓室"]
[]
[null,"■申込先","■申し込み先   　 片岡一寿（うさかめ代表）"]
[null,null,"■連絡先　　　　　０９０－３０３８－３１３９"]
[null,null,"■メールアドレス　　ｐｔｋｑ６７１８０@ｙａｈｏｏ．cｏ．jｐ"]
[null,null,"■銀行口座　　　　ゆうちょ銀行　　14640-03483751 カタオカ　カズトシ　　"]
[]
[null,"■注意事項","1. 試合終了後　お互いの健闘を称えあいしっかりと「握手」をしてください"]
[null,null,"2. 試合中のミラーサングラス・フェイスマスクの使用は禁止です。"]
[null,null,"3. 試合審判は、セルフジャッジとなります。"]
[null,null,"4. 試合球は、ダンロップフォートを使用します。"]
[null,null,"5. 試合中の事故に関して東近江市テニス協会は一切責任を負いません。"]
[null,null,"6. 試合会場に各自で持ち込んだごみは持ち帰るようお願いします。"]
[null,null,"7. その他、試合前の説明事項を遵守ください。"]
[null,"　　　　　　　　　　"]

{"sheet":"申込書","index":1,"n_rows":53,"n_cols":7,"rows_kept":53,"cut":false,"hidden":false,"merged":[[25,1,25,2],[29,6,31,6],[32,1,34,1],[32,2,34,2],[32,3,34,3],[32,4,34,4],[32,5,34,5],[32,6,34,6],[29,1,31,1],[29,2,31,2],[29,3,31,3],[29,4,31,4],[29,5,31,5],[21,3,23,3],[21,4,23,4],[21,5,23,5],[21,6,23,6],[18,1,20,1],[18,2,20,2],[18,3,20,3],[18,4,20,4],[18,5,20,5],[0,1,0,5],[8,1,10,1],[8,2,10,2],[4,1,4,2],[8,3,10,3],[5,2,5,3],[8,4,10,4],[8,5,10,5],[40,6,42,6],[43,1,45,1],[43,2,45,2],[43,3,45,3],[43,4,45,4],[43,5,45,5],[43,6,45,6],[40,1,42,1],[40,2,42,2],[40,3,42,3],[40,4,42,4],[40,5,42,5],[37,2,37,3],[26,2,26,3],[15,2,15,3],[1,2,1,3],[3,0,3,6],[2,2,2,6],[11,1,13,1],[11,2,13,2],[11,4,13,4],[11,3,13,3],[8,6,10,6],[11,6,13,6],[11,5,13,5],[18,6,20,6],[21,1,23,1],[21,2,23,2],[49,5,49,6],[50,5,50,6],[51,5,51,6],[52,5,52,6],[48,5,48,6]]}
[null,"第２１回　東近江カップ　大会申込書"]
[null,"所属クラブ名",null,null,"代表者氏名"]
[null,"代表連絡先"]
["この登録したメンバー以外が試合に出る場合は変更をクラブ代表者から届けること。1人につき１０００円"]
[null,"一般の部"]
[null,"男子","チーム名（９文字以内）",null,"女子"]
[null,"登録ナンバー","氏　　名","年齢","登録ナンバー","氏　　名","年齢"]
[null,null,{"$f":"IF(B8=\"\",\"\",VLOOKUP(B8,登録ナンバー!$A$4:$G$292,7,0))","v":""},{"$f":"IF(C8=\"\",\"\",VLOOKUP(B8,登録ナンバー!$A$4:$L$292,11,0))","v":""},null,{"$f":"IF(E8=\"\",\"\",VLOOKUP(E8,登録ナンバー!$A$4:$G$292,7,0))","v":""},{"$f":"IF(F8=\"\",\"\",VLOOKUP(E8,登録ナンバー!$A$4:$L$292,11,0))","v":""}]
[null,null,{"$f":"IF(B9=\"\",\"\",VLOOKUP(B9,登録ナンバー!$A$4:$G$292,7,0))","v":""},{"$f":"IF(B9=\"\",\"\",VLOOKUP(B9,登録ナンバー!$A$4:$L$292,11,0))","v":""},null,{"$f":"IF(E9=\"\",\"\",VLOOKUP(E9,登録ナンバー!$A$4:$G$292,7,0))","v":""},{"$f":"IF(F9=\"\",\"\",VLOOKUP(E9,登録ナンバー!$A$4:$L$292,11,0))","v":""}]
[]
[]
[null,null,{"$f":"IF(B12=\"\",\"\",VLOOKUP(B12,登録ナンバー!$A$4:$G$292,7,0))","v":""},{"$f":"IF(B12=\"\",\"\",VLOOKUP(B12,登録ナンバー!$A$4:$L$292,11,0))","v":""},null,{"$f":"IF(E12=\"\",\"\",VLOOKUP(E12,登録ナンバー!$A$4:$G$292,7,0))","v":""},{"$f":"IF(F12=\"\",\"\",VLOOKUP(E12,登録ナンバー!$A$4:$L$292,11,0))","v":""}]
[]
[]
[]
[null,"男子","チーム名（９文字以内）",null,"女子"]
[null,"登録ナンバー","氏　　名","年齢","登録ナンバー","氏　　名","年齢"]
[null,null,{"$f":"IF(B18=\"\",\"\",VLOOKUP(B18,登録ナンバー!$A$4:$G$292,7,0))","v":""},{"$f":"IF(C18=\"\",\"\",VLOOKUP(B18,登録ナンバー!$A$4:$L$292,11,0))","v":""},null,{"$f":"IF(E18=\"\",\"\",VLOOKUP(E18,登録ナンバー!$A$4:$G$292,7,0))","v":""},{"$f":"IF(F18=\"\",\"\",VLOOKUP(E18,登録ナンバー!$A$4:$L$292,11,0))","v":""}]
[null,null,{"$f":"IF(B19=\"\",\"\",VLOOKUP(B19,登録ナンバー!$A$4:$G$292,7,0))","v":""},{"$f":"IF(B19=\"\",\"\",VLOOKUP(B19,登録ナンバー!$A$4:$L$292,11,0))","v":""},null,{"$f":"IF(E19=\"\",\"\",VLOOKUP(E19,登録ナンバー!$A$4:$G$292,7,0))","v":""},{"$f":"IF(F19=\"\",\"\",VLOOKUP(E19,登録ナンバー!$A$4:$L$292,11,0))","v":""}]
[]
[]
[null,null,{"$f":"IF(B22=\"\",\"\",VLOOKUP(B22,登録ナンバー!$A$4:$G$292,7,0))","v":""},{"$f":"IF(B22=\"\",\"\",VLOOKUP(B22,登録ナンバー!$A$4:$L$292,11,0))","v":""},null,{"$f":"IF(E22=\"\",\"\",VLOOKUP(E22,登録ナンバー!$A$4:$G$292,7,0))","v":""},{"$f":"IF(F22=\"\",\"\",VLOOKUP(E22,登録ナンバー!$A$4:$L$292,11,0))","v":""}]
[]
[]
[]
[null,"ＯＶ350の部"]
[null,"男子","チーム名（９文字以内）",null,"女子"]
[null,"登録ナンバー","氏　　名","年齢","登録ナンバー","氏　　名","年齢"]
[null,null,{"$f":"IF(B29=\"\",\"\",VLOOKUP(B29,登録ナンバー!$A$4:$G$292,7,0))","v":""},{"$f":"IF(C29=\"\",\"\",VLOOKUP(B29,登録ナンバー!$A$4:$L$292,11,0))","v":""},null,{"$f":"IF(E29=\"\",\"\",VLOOKUP(E29,登録ナンバー!$A$4:$G$292,7,0))","v":""},{"$f":"IF(F29=\"\",\"\",VLOOKUP(E29,登録ナンバー!$A$4:$L$292,11,0))","v":""}]
[null,null,{"$f":"IF(B30=\"\",\"\",VLOOKUP(B30,登録ナンバー!$A$4:$G$292,7,0))","v":""},{"$f":"IF(B30=\"\",\"\",VLOOKUP(B30,登録ナンバー!$A$4:$L$292,11,0))","v":""},null,{"$f":"IF(E30=\"\",\"\",VLOOKUP(E30,登録ナンバー!$A$4:$G$292,7,0))","v":""},{"$f":"IF(F30=\"\",\"\",VLOOKUP(E30,登録ナンバー!$A$4:$L$292,11,0))","v":""}]
[]
[]
[null,null,{"$f":"IF(B33=\"\",\"\",VLOOKUP(B33,登録ナンバー!$A$4:$G$292,7,0))","v":""},{"$f":"IF(B33=\"\",\"\",VLOOKUP(B33,登録ナンバー!$A$4:$L$292,11,0))","v":""},null,{"$f":"IF(E33=\"\",\"\",VLOOKUP(E33,登録ナンバー!$A$4:$G$292,7,0))","v":""},{"$f":"IF(F33=\"\",\"\",VLOOKUP(E33,登録ナンバー!$A$4:$L$292,11,0))","v":""}]
[]
[]
[null,null,"合計年齢",{"$f":"IF(B29=\"\",\"\",G29+G30+G33+D29+D30+D33)","v":""},null,"参加可否",{"$f":"IF(D36>=350,\"可\",\"不可\")","v":"可"}]
[]
[null,"男子","チーム名（９文字以内）",null,"女子"]
[null,"登録ナンバー","氏　　名","年齢","登録ナンバー","氏　　名","年齢"]
[null,null,{"$f":"IF(B40=\"\",\"\",VLOOKUP(B40,登録ナンバー!$A$4:$G$292,7,0))","v":""},{"$f":"IF(C40=\"\",\"\",VLOOKUP(B40,登録ナンバー!$A$4:$L$292,11,0))","v":""},null,{"$f":"IF(E40=\"\",\"\",VLOOKUP(E40,登録ナンバー!$A$4:$G$292,7,0))","v":""},{"$f":"IF(F40=\"\",\"\",VLOOKUP(E40,登録ナンバー!$A$4:$L$292,11,0))","v":""}]
[null,null,{"$f":"IF(B41=\"\",\"\",VLOOKUP(B41,登録ナンバー!$A$4:$G$292,7,0))","v":""},{"$f":"IF(B41=\"\",\"\",VLOOKUP(B41,登録ナンバー!$A$4:$L$292,11,0))","v":""},null,{"$f":"IF(E41=\"\",\"\",VLOOKUP(E41,登録ナンバー!$A$4:$G$292,7,0))","v":""},{"$f":"IF(F41=\"\",\"\",VLOOKUP(E41,登録ナンバー!$A$4:$L$292,11,0))","v":""}]
[]
[]
[null,null,{"$f":"IF(B44=\"\",\"\",VLOOKUP(B44,登録ナンバー!$A$4:$G$292,7,0))","v":""},{"$f":"IF(B44=\"\",\"\",VLOOKUP(B44,登録ナンバー!$A$4:$L$292,11,0))","v":""},null,{"$f":"IF(E44=\"\",\"\",VLOOKUP(E44,登録ナンバー!$A$4:$G$292,7,0))","v":""},{"$f":"IF(F44=\"\",\"\",VLOOKUP(E44,登録ナンバー!$A$4:$L$292,11,0))","v":""}]
[]
[]
[null,null,"合計年齢",{"$f":"IF(B40=\"\",\"\",G40+G41+G44+D40+D41+D44)","v":""},null,"参加可否",{"$f":"IF(D47>=350,\"可\",\"不可\")","v":"可"}]
[]
[null,null,"参加費",null,"人数","小計"]
[null,null,"協会員",1000,null,{"$f":"D50*E50","v":0}]
[null,null,"一般",2000,null,{"$f":"D51*E51","v":0}]
[null,null,"ジュニア",500,null,{"$f":"D52*E52","v":0}]
[null,null,null,null,"合計",{"$f":"SUM(F50:F52)","v":0}]

{"sheet":"登録ナンバー","index":2,"n_rows":291,"n_cols":13,"rows_kept":291,"cut":false,"hidden":false,"merged":[[0,1,1,7],[0,8,1,12]]}
[null,"２０２５年度東近江市テニス協会登録ナンバー",null,null,null,null,null,null,"2025.2.25"]
[]
[null,1]
["あ０１","青木","重之","アビック",null,{"$f":"A4","v":"あ０１"},{"$f":"B4&C4","v":"青木重之"},"アビックBB","男",1971,{"$f":"IF(J4=\"\",\"\",(2025-J4))","v":54},{"$f":"IF(G4=\"\",\"\",IF(COUNTIF($G$4:$G$294,G4)>1,\"2重登録\",\"OK\"))","v":"OK"},"草津市"]
["あ０２","西川","昌一","アビック",null,{"$f":"A5","v":"あ０２"},"西川昌一","アビックBB","男",1970,{"$f":"IF(J5=\"\",\"\",(2025-J5))","v":55},"OK","彦根市"]
["あ０３","安達","隆一","アビック",null,{"$f":"A6","v":"あ０３"},"安達隆一","アビックBB","男",1970,55,"OK","甲賀市"]
["あ０４","上原","義弘","アビック",null,{"$f":"A7","v":"あ０４"},"上原義弘","アビックBB","男",1974,51,"OK","彦根市"]
["あ０５","寺村","浩一","アビック",null,{"$f":"A8","v":"あ０５"},"寺村浩一","アビックBB","男",1968,57,"OK","愛荘町"]
["あ０６","谷崎","真也","アビック",null,{"$f":"A9","v":"あ０６"},"谷崎真也","アビックBB","男",1972,{"$f":"IF(J9=\"\",\"\",(2025-J9))","v":53},"OK","甲賀市"]
["あ０７","齋田","優子","アビック",null,"あ０７","齋田優子","アビックBB","女",1970,55,"OK","彦根市"]
["あ０８","平居","崇","アビック",null,"あ０８","平居崇","アビックBB","男",1972,53,"OK","多賀町"]
["あ０９","大林","弘典","アビック",null,"あ０９","大林弘典","アビックBB","男",1989,36,"OK","長浜市"]
["あ１０","福嶋","亮","アビック",null,"あ１０","福嶋亮","アビックBB","男",1961,64,"OK","養老町"]
["あ１１","三原","啓子","アビック",null,"あ１１","三原啓子","アビックBB","女",1964,{"$f":"IF(J14=\"\",\"\",(2025-J14))","v":61},"OK","彦根市"]
["あ１２","落合","良弘","アビック",null,"あ１２","落合良弘","アビックBB","男",1968,57,"OK","長浜市"]
["あ１３","松井","傳樹 ","アビック",null,"あ１３","松井傳樹 ","アビックBB","男",1987,38,"OK","彦根市"]
["あ１４","中村","紗映子","アビック",null,"あ１４","中村紗映子","アビックBB","女",1983,42,"OK","長浜市"]
["あ１５","長谷川","優","アビック",null,"あ１５","長谷川優","アビックBB","男",1973,52,"OK","甲賀市"]
["あ１６","成宮","まき","アビック",null,"あ１６","成宮まき","アビックBB","女",1970,55,"OK","彦根市"]
["あ１７","松本","光美","アビック",null,"あ１７","松本光美","アビックBB","女",1971,54,"OK","草津市"]
["あ１８","草野","活地","アビック",null,"あ１８","草野活地","アビックBB","男",1974,51,"OK","草津市"]
["あ１９","吉川","孝次","アビック",null,"あ１９","吉川孝次","アビックBB","男",1976,49,"OK","彦根市"]
["あ２０","姫田","和憲","アビック",null,"あ２０","姫田和憲","アビックBB","男",1984,41,"OK","京都市"]
["あ２１","堅田","瑞木","アビック",null,"あ２１","堅田瑞木","アビックBB","女",1996,29,"OK","京都市"]
["あ２２","堀田","明子","アビック",null,"あ２２","堀田明子","アビックBB","女",1970,55,"OK","東近江市"]
["あ２３","法戸","義也","アビック",null,"あ２３","法戸義也","アビックBB","男",1983,42,"OK","米原市"]
["あ２４","佐野","直美","アビック",null,"あ２４","佐野直美","アビックBB","女",1975,50,"OK","京都市"]
["あ２５","千代","美由紀","アビック",null,"あ２５","千代美由紀","アビックBB","女",1972,53,"OK","栗東市"]
["あ２６","小西","由美子","アビック",null,"あ２６","小西由美子","アビックBB","女",1968,57,"OK","近江八幡市"]
["あ２７","徳田","裕子","アビック",null,"あ２７","徳田裕子","アビックBB","女",1971,54,"OK","近江八幡市"]
["あ２８","叶丸","利恵子","アビック",null,"あ２８","叶丸利恵子","アビックBB","女",1965,60,"OK","草津市"]
["あ２９","脇田","里加","アビック",null,"あ２９","脇田里加","アビックBB","女",1963,62,"OK","草津市"]
["あ３０","冨岡","浩史","アビック",null,"あ３０","冨岡浩史","アビックBB","男",1967,58,"OK","草津市"]
["あ３１","西堀","公人","アビック",null,"あ３１","西堀公人","アビックBB","男",1984,41,"OK","近江八幡市"]
["あ３２","清野","宏樹","アビック",null,"あ３２","清野宏樹","アビックBB","男",1987,38,"OK","京都市"]
["あ３３","宇野","泰三","アビック",null,"あ３３","宇野泰三","アビックBB","女",1974,51,"OK","野洲市"]
["あ３４","中澤","由香","アビック",null,"あ３４","中澤由香","アビックBB","男",1975,50,"OK","草津市"]
["あ３５","坪井","徳寿","アビック",null,"あ３５","坪井徳寿","アビックBB","男",1979,46,"OK","草津市"]
["あ３６","山中","博子","アビック",null,"あ３６","山中博子","アビックBB","女",1970,55,"OK","野洲市"]
[null,2]
["あぷ０１","杉山","邦夫","アプストTC","ｓｅ",{"$f":"A41","v":"あぷ０１"},{"$f":"B41&C41","v":"杉山邦夫"},"アプストTC","男",1950,{"$f":"IF(J41=\"\",\"\",(2025-J41))","v":75},{"$f":"IF(G41=\"\",\"\",IF(COUNTIF($G$4:$G$319,G41)>1,\"2重登録\",\"OK\"))","v":"OK"},"犬上郡"]
["あぷ０２","川上","英二","アプストTC",null,{"$f":"A42","v":"あぷ０２"},"川上英二","アプストTC","男",1963,{"$f":"IF(J42=\"\",\"\",(2025-J42))","v":62},"OK","東近江市"]
["あぷ０３","浅田","隆昭","アプストTC",null,{"$f":"A43","v":"あぷ０３"},"浅田隆昭","アプストTC","男",1964,61,"OK","守山市"]
["あぷ０４","森永","洋介","アプストTC",null,{"$f":"A44","v":"あぷ０４"},"森永洋介","アプストTC","男",1986,39,"OK","近江八幡市"]
["あぷ０５","辰巳","悟朗","アプストTC",null,{"$f":"A45","v":"あぷ０５"},"辰巳悟朗","アプストTC","男",1974,51,"OK","彦根市"]
["あぷ０６","川上","美弥子","アプストTC",null,{"$f":"A46","v":"あぷ０６"},"川上美弥子","アプストTC","女",1971,{"$f":"IF(J46=\"\",\"\",(2025-J46))","v":54},"OK","東近江市"]
["あぷ０７","山内","雄平","アプストTC",null,"あぷ０７","山内雄平","アプストTC","男",1989,36,"OK","東近江市"]
["あぷ０８","木村","美香","アプストTC",null,"あぷ０８","木村美香","アプストTC","女",1962,63,"OK","米原市"]
["あぷ０９","梶木","和子","アプストTC",null,"あぷ０９","梶木和子","アプストTC","女",1960,65,"OK","彦根市"]
["あぷ１０","日高","眞規子","アプストTC",null,"あぷ１０","日高眞規子","アプストTC","女",1963,62,"OK","長浜市"]
["あぷ１１","長谷出","浩","アプストTC",null,"あぷ１１","長谷出浩","アプストTC","男",1960,{"$f":"IF(J51=\"\",\"\",(2025-J51))","v":65},"OK","東近江市"]
["あぷ１２","奥田","純也","アプストTC",null,"あぷ１２","奥田純也","アプストTC","男",1963,62,"OK","東近江市"]
["あぷ１３","村田","朋子","アプストTC",null,"あぷ１３","村田朋子","アプストTC","女",1959,66,"OK","東近江市"]
["あぷ１４","村田","理恵子","アプストTC",null,"あぷ１４","村田理恵子","アプストTC","女",1979,46,"OK","東近江市"]
["あぷ１５","東","正隆","アプストTC",null,"あぷ１５","東正隆","アプストTC","男",1965,60,"OK","彦根市"]
["あぷ１６","二ツ井","裕也","アプストTC",null,"あぷ１６","二ツ井裕也","アプストTC","男",1990,35,"OK","京都府"]
["あぷ１７","田中　","有紀","アプストTC",null,"あぷ１７","田中　有紀","アプストTC","女",1969,56,"OK","蒲生郡"]
["あぷ１８","岡川","謙二","アプストTC",null,"あぷ１８","岡川謙二","アプストTC","男",1967,58,"OK","近江八幡市"]
["あぷ１９","稲泉","聡","アプストTC",null,"あぷ１９","稲泉聡","アプストTC","男",1967,58,"OK","近江八幡市"]
["あぷ２０","妹川","寿明","アプストTC",null,"あぷ２０","妹川寿明","アプストTC","男",1995,30,"OK","東近江市"]
["あぷ２１","妹川","麻佑","アプストTC",null,"あぷ２１","妹川麻佑","アプストTC","女",1995,30,"OK","東近江市"]
["あぷ２２","永松","貴子","アプストTC",null,"あぷ２２","永松貴子","アプストTC","女",1962,63,"OK","彦根市"]
["あぷ２３","藤原","泰子","アプストTC",null,"あぷ２３","藤原泰子","アプストTC","女",1965,60,"OK","守山市"]
["あぷ２４","敦賀","創一","アプストTC",null,"あぷ２４","敦賀創一","アプストTC","男",1998,27,"OK","彦根市"]
["あぷ２５","有吉","裕喜","アプストTC",null,"あぷ２５","有吉裕喜","アプストTC","男",1973,52,"OK","湖南市"]
["あぷ２６","松原","礼","アプストTC",null,"あぷ２６","松原礼","アプストTC","男",1987,38,"OK","東近江市"]
["あぷ２７","福岡","由布加","アプストTC",null,"あぷ２７","福岡由布加","アプストTC","女",1999,26,"OK","東近江市"]
[null,3]
["あん０１","池田","枝里","アンヴァース",null,{"$f":"A69","v":"あん０１"},{"$f":"B69&C69","v":"池田枝里"},"アンヴァース","女",1986,{"$f":"IF(J69=\"\",\"\",(2025-J69))","v":39},{"$f":"IF(G69=\"\",\"\",IF(COUNTIF($G$7:$G$347,G69)>1,\"2重登録\",\"OK\"))","v":"OK"},"彦根市"]
["あん０２","植田","早耶","アンヴァース",null,{"$f":"A70","v":"あん０２"},{"$f":"B70&C70","v":"植田早耶"},"アンヴァース","女",1999,{"$f":"IF(J70=\"\",\"\",(2025-J70))","v":26},"OK","東近江市"]
["あん０３","山口","千恵","アンヴァース",null,{"$f":"A71","v":"あん０３"},{"$f":"B71&C71","v":"山口千恵"},"アンヴァース","女",1979,46,"OK","守山市"]
["あん０４","森","心奈","アンヴァース",null,"あん０４","森心奈","アンヴァース","女",2013,12,"OK","栗東市"]
["あん０５","脇坂","愛里","アンヴァース",null,"あん０５","脇坂愛里","アンヴァース","女",1989,36,"OK","彦根市"]
["あん０６","上津","慶和","アンヴァース",null,"あん０６","上津慶和","アンヴァース","男",1993,32,"OK","大津市"]
["あん０７","脇坂","和樹","アンヴァース",null,"あん０７","脇坂和樹","アンヴァース","男",1992,33,"OK","彦根市"]
["あん０８","小田","紀彦","アンヴァース",null,"あん０８","小田紀彦","アンヴァース","男",1984,41,"OK","野洲市"]
["あん０９","越智","友基","アンヴァース",null,"あん０９","越智友基","アンヴァース","男",1987,38,"OK","野洲市"]
["あん１０","辻本","将士","アンヴァース",null,"あん１０","辻本将士","アンヴァース","男",1986,39,"OK","東近江市"]
["あん１１","津曲","崇志","アンヴァース",null,"あん１１","津曲崇志","アンヴァース","男",1989,36,"OK","湖南市"]
["あん１２","鍋内","雄樹","アンヴァース",null,"あん１２","鍋内雄樹","アンヴァース","男",1990,35,"OK","蒲生郡"]
["あん１３","桐原","昇汰","アンヴァース",null,"あん１３","桐原昇汰","アンヴァース","男",1994,31,"OK","守山市"]
["あん１４","松村","友喜","アンヴァース",null,"あん１４","松村友喜","アンヴァース","男",1988,37,"OK","彦根市"]
["あん１５","薮内","豪","アンヴァース",null,"あん１５","薮内豪","アンヴァース","男",1986,39,"OK","長浜市"]
["あん１６","森","寿人","アンヴァース",null,"あん１６","森寿人","アンヴァース","男",1978,47,"OK","栗東市"]
["あん１７","山田","佳明","アンヴァース",null,"あん１７","山田佳明","アンヴァース","男",1986,39,"OK","彦根市"]
["あん１８","愛原","里樹","アンヴァース",null,"あん１８","愛原里樹","アンヴァース","男",1995,30,"OK","大津市"]
["あん１９","岡田","真樹","アンヴァース",null,"あん１９","岡田真樹","アンヴァース","男",1982,43,"OK","草津市"]
["あん２０","鈴木","悠太","アンヴァース",null,"あん２０","鈴木悠太","アンヴァース","男",2000,25,"OK","草津市"]
["あん２１","政田","秀栄","アンヴァース",null,"あん２１","政田秀栄","アンヴァース","男",1982,43,"OK","栗東市"]
["あん２２","猪飼","尚輝","アンヴァース",null,"あん２２","猪飼尚輝","アンヴァース","男",1996,29,"OK","栗東市"]
["あん２３","岡","栄介","アンヴァース",null,"あん２３","岡栄介","アンヴァース","男",1996,29,"OK","栗東市"]
["あん２４","寺元","翔太","アンヴァース",null,"あん２４","寺元翔太","アンヴァース","男",1993,32,"OK","長浜市"]
["あん２５","三箇","将士","アンヴァース",null,"あん２５","三箇将士","アンヴァース","男",1994,31,"OK","長浜市"]
["あん２６","澤田","純兵","アンヴァース",null,"あん２６","澤田純兵","アンヴァース","男",1997,28,"OK","長浜市"]
[null,4]
["け０１","稲岡","和紀","Kテニス",null,"け０１","稲岡和紀","Ｋテニスカレッジ","男",1978,{"$f":"IF(J96=\"\",\"\",(2025-J96))","v":47},{"$f":"IF(H96=\"\",\"\",IF(COUNTIF($G$4:$G$21,H96)>1,\"2重登録\",\"OK\"))","v":"OK"},"東近江市"]
["け０２","上村","　武","Kテニス",null,"け０２","上村　武","Ｋテニスカレッジ","男",1978,{"$f":"IF(J97=\"\",\"\",(2025-J97))","v":47},"OK","彦根市"]
["け０３","川上","悠作","Kテニス",null,"け０３","川上悠作","Ｋテニスカレッジ","男",2000,25,"OK","東近江市"]
["け０４","川並","和之","Kテニス",null,"け０４","川並和之","Ｋテニスカレッジ","男",1959,66,"OK","東近江市"]
["け０５","坪田","真嘉","Kテニス",null,"け０５","坪田真嘉","Ｋテニスカレッジ","男",1976,49,"OK","東近江市"]
["け０７","永里","裕次","Kテニス",null,"け０７","永里裕次","Ｋテニスカレッジ","男",1979,46,"OK","三重県"]
["け０８","山口","直彦","Kテニス",null,"け０８","山口直彦","Ｋテニスカレッジ","男",1986,39,"OK","東近江市"]
["け０９","福永","裕美","Kテニス",null,"け０９","福永裕美","Ｋテニスカレッジ","女",1963,62,"OK","東近江市"]
["け１０","福永","一典","Kテニス",null,"け１０","福永一典","Ｋテニスカレッジ","男",1967,58,"OK","近江八幡市"]
["け１１","小澤","藤信","Kテニス",null,"け１１","小澤藤信","Ｋテニスカレッジ","男",1964,61,"OK","彦根市"]
["け１２","疋田","之宏","Kテニス",null,"け１２","疋田之宏","Ｋテニスカレッジ","男",1960,65,"OK","東近江市"]
["け１３","朝日","尚紀","Kテニス",null,"け１３","朝日尚紀","Ｋテニスカレッジ","男",1983,42,{"$f":"IF(H107=\"\",\"\",IF(COUNTIF($G$4:$G$142,H107)>1,\"2重登録\",\"OK\"))","v":"OK"},"三重県"]
["け１４","朝日","智美","Kテニス",null,"け１４","朝日智美","Ｋテニスカレッジ","女",1983,42,{"$f":"IF(H108=\"\",\"\",IF(COUNTIF($G$4:$G$21,H108)>1,\"2重登録\",\"OK\"))","v":"OK"},"三重県"]
["け１５","本多","勇輝","Kテニス",null,"け１５","本多勇輝","Ｋテニスカレッジ","男",1989,36,"OK","守山市"]
["け１６","堤","泰彦","Kテニス",null,"け１６","堤泰彦","Ｋテニスカレッジ","男",1987,38,"OK","東近江市"]
["け１７","新谷","良","Kテニス",null,"け１７","新谷良","Ｋテニスカレッジ","男",1984,41,"OK","湖南市"]
["け１８","川上","駿亮","Kテニス",null,"け１８","川上駿亮","Ｋテニスカレッジ","男",1997,28,"OK","東近江市"]
["け１９","山口","真彦","Kテニス",null,{"$f":"A114","v":"け２０"},"山口真彦","Ｋテニスカレッジ","男",1991,34,"OK","近江八幡市"]
["け２０","西田","和教","Kテニス",null,{"$f":"A115","v":"け２１"},"西田和教","Ｋテニスカレッジ","男",1966,59,"OK","彦根市"]
["け２１","上村","悠大","Kテニス",null,{"$f":"A115","v":"け２１"},"上村悠大","Ｋテニスカレッジ","男",2001,24,"OK","彦根市"]
["け２２","森","彩","Kテニス",null,"け２２","森彩","Ｋテニスカレッジ","女",1977,48,"OK","近江八幡市"]
[null,5]
["き０１","赤木","拓","京セラTC",null,{"$f":"A118","v":"き０１"},"赤木拓","京セラTC","男",1980,{"$f":"IF(J118=\"\",\"\",(2025-J118))","v":45},{"$f":"IF(H118=\"\",\"\",IF(COUNTIF($G$4:$G$21,H118)>1,\"2重登録\",\"OK\"))","v":"OK"},"近江八幡市"]
["き０２","荒浪","順次","京セラTC",null,{"$f":"A119","v":"き０２"},"荒浪順次","京セラTC","男",1977,{"$f":"IF(J119=\"\",\"\",(2025-J119))","v":48},{"$f":"IF(H119=\"\",\"\",IF(COUNTIF($G$4:$G$21,H119)>1,\"2重登録\",\"OK\"))","v":"OK"},"大津市"]
["き０３","井澤　","匡志","京セラTC",null,{"$f":"A120","v":"き０３"},"井澤　匡志","京セラTC","男",1967,58,{"$f":"IF(H120=\"\",\"\",IF(COUNTIF($G$4:$G$21,H120)>1,\"2重登録\",\"OK\"))","v":"OK"},"東近江市"]
["き０４","石井","耶真斗","京セラTC",null,{"$f":"A121","v":"き０４"},"石井耶真斗","京セラTC","男",1995,30,{"$f":"IF(H121=\"\",\"\",IF(COUNTIF($G$4:$G$21,H121)>1,\"2重登録\",\"OK\"))","v":"OK"},"東近江市"]
["き０５","石川","和洋","京セラTC",null,{"$f":"A122","v":"き０５"},"石川和洋","京セラTC","男",1978,47,{"$f":"IF(H122=\"\",\"\",IF(COUNTIF($G$4:$G$21,H122)>1,\"2重登録\",\"OK\"))","v":"OK"},"竜王町"]
["き０６","石田","文彦","京セラTC",null,{"$f":"A123","v":"き０６"},"石田文彦","京セラTC","男",1993,{"$f":"IF(J123=\"\",\"\",(2025-J123))","v":32},{"$f":"IF(G123=\"\",\"\",IF(COUNTIF($G$5:$G$354,G123)>1,\"2重登録\",\"OK\"))","v":"OK"},"近江八幡市"]
["き０７","石田","愛捺花","京セラTC",null,"き０７","石田愛捺花","京セラTC","女",1998,27,"OK","近江八幡市"]
["き０８","一色","翼","京セラTC",null,"き０８","一色翼","京セラTC","男",1984,41,"OK","東近江市"]
["き０９","牛尾","紳之介","京セラTC",null,"き０９","牛尾紳之介","京セラTC","男",1984,41,"OK","東近江市"]
["き１０","太田","圭亮","京セラTC",null,"き１０","太田圭亮","京セラTC","男",1981,44,"OK","近江八幡市"]
["き１１","奥田","司","京セラTC",null,"き１１","奥田司","京セラTC","男",1997,{"$f":"IF(J128=\"\",\"\",(2025-J128))","v":28},"OK","東近江市"]
["き１２","木村","圭","京セラTC",null,"き１２","木村圭","京セラTC","男",1968,57,"OK","大津市"]
["き１３","栗山","飛鳥","京セラTC",null,"き１３","栗山飛鳥","京セラTC","男",1997,28,"OK","東近江市"]
["き１４","澤田","啓一","京セラTC",null,"き１４","澤田啓一","京セラTC","男",1970,55,"OK","野洲市"]
["き１５","清水","陽介","京セラTC",null,"き１５","清水陽介","京セラTC","男",1991,34,"OK","守山市"]
["き１６","曽我","卓矢","京セラTC",null,"き１６","曽我卓矢","京セラTC","男",1986,39,"OK","近江八幡市"]
["き１７","中尾","慶太","京セラTC",null,"き１７","中尾慶太","京セラTC","男",1993,32,"OK","野洲市"]
["き１８","仲田","慶介","京セラTC",null,"き１８","仲田慶介","京セラTC","男",1996,29,"OK","京都府"]
["き１９","永田","寛教","京セラTC",null,"き１９",{"$f":"B136&C136","v":"永田寛教"},"京セラTC","男",1996,29,"OK","東近江市"]
["き２０","馬場","英年","京セラTC",null,"き２０","馬場英年","京セラTC","男",1980,45,"OK","東近江市"]
["き２１","濵口","里穂","京セラTC",null,"き２１","濵口里穂","京セラTC","女",1993,32,"OK","湖南市"]
["き２２","平瀬","俊介","京セラTC",null,"き２２","平瀬俊介","京セラTC","男",1989,36,"OK","東近江市"]
["き２３","廣瀬","智也","京セラTC",null,"き２３","廣瀬智也","京セラTC","男",1977,48,"OK","野洲市"]
["き２４","福島","勇輔","京セラTC",null,"き２４","福島勇輔","京セラTC","男",1996,29,"OK","野洲市"]
["き２５","松島","理和","京セラTC",null,"き２５","松島理和","京セラTC","男",1981,44,"OK","京都府"]
["き２６","松本","拓大","京セラTC",null,"き２６","松本拓大","京セラTC","男",2004,21,"OK","東近江市"]
["き２７","宮道","祐介","京セラTC",null,"き２７","宮道祐介","京セラTC","男",1983,42,"OK","彦根市"]
["き２８","村尾","彰了","京セラTC",null,"き２８","村尾彰了","京セラTC","男",1982,43,"OK","野洲市"]
["き２９","村西","徹","京セラTC",null,"き２９","村西徹","京セラTC","男",1988,37,"OK","守山市"]
["き３０","森","涼花","京セラTC",null,"き３０","森涼花","京セラTC","女",2003,22,"OK","湖南市"]
["き３１","安武","義剛","京セラTC",null,"き３１","安武義剛","京セラTC","男",1990,35,"OK","京都府"]
["き３２","山田","修平","京セラTC",null,"き３２","山田修平","京セラTC","男",2003,22,"OK","野洲市"]
["き３３","山本","和樹","京セラTC",null,"き３３","山本和樹","京セラTC","男",1997,28,"OK","大津市"]
["き３４","吉本","泰二","京セラTC",null,"き３４","吉本泰二","京セラTC","男",1976,49,"OK","近江八幡市"]
["き３５","滝本","照夫","京セラTC",null,"き３５","滝本照夫","京セラTC","男",1959,66,"OK","東近江市"]
[null,6]
["ぐ０１","鍵谷","浩太","グリフィンズ",null,"ぐ０１",{"$f":"B154&C154","v":"鍵谷浩太"},"東近江グリフィンズ","男",1991,34,{"$f":"IF(G154=\"\",\"\",IF(COUNTIF($G$5:$G$354,G154)>1,\"2重登録\",\"OK\"))","v":"OK"},"彦根市"]
["ぐ０２","浅田","恵亮","グリフィンズ",null,"ぐ０２",{"$f":"B155&C155","v":"浅田恵亮"},"東近江グリフィンズ","男",1986,39,"OK","草津市"]
["ぐ０３","中西","泰輝","グリフィンズ",null,"ぐ０３","中西泰輝","東近江グリフィンズ","男",1992,33,"OK","守山市"]
["ぐ０４","井ノ口","幹也","グリフィンズ",null,"ぐ０４","井ノ口幹也","東近江グリフィンズ","男",1990,35,"OK","東近江市"]
["ぐ０５","漆原","大介","グリフィンズ",null,"ぐ０５","漆原大介","東近江グリフィンズ","男",1988,37,"OK","彦根市"]
["ぐ０６","土田","哲也","グリフィンズ",null,"ぐ０６","土田哲也","東近江グリフィンズ","男",1990,35,"OK","長浜市"]
["ぐ０７","金谷","太郎","グリフィンズ",null,"ぐ０７","金谷太郎","東近江グリフィンズ","男",1976,49,"OK","彦根市"]
["ぐ０８","山本","将義","グリフィンズ",null,"ぐ０８","山本将義","東近江グリフィンズ","男",1986,39,"OK","彦根市"]
["ぐ０９","浜田","豊","グリフィンズ",null,"ぐ０９","浜田豊","東近江グリフィンズ","男",1985,40,"OK","東近江市"]
["ぐ１０","吉野","淳也","グリフィンズ",null,"ぐ１０","吉野淳也","東近江グリフィンズ","男",1990,35,"OK","守山市"]
["ぐ１１","寺本","将吾","グリフィンズ",null,"ぐ１１","寺本将吾","東近江グリフィンズ","男",1997,28,"OK","守山市"]
["ぐ１２","澁谷","晃大","グリフィンズ",null,"ぐ１２","澁谷晃大","東近江グリフィンズ","男",1996,29,"OK","彦根市"]
["ぐ１３","藤井","正和","グリフィンズ",null,"ぐ１３","藤井正和","東近江グリフィンズ","男",1975,50,"OK","草津市"]
["ぐ１４","平野","優也","グリフィンズ",null,"ぐ１４","平野優也","東近江グリフィンズ","男",1993,32,"OK","三重県"]
["ぐ１５","久保村","悠史","グリフィンズ",null,"ぐ１５","久保村悠史","東近江グリフィンズ","男",1990,35,"OK","京都府"]
["ぐ１６","須賀","雅雄","グリフィンズ",null,"ぐ１６","須賀雅雄","東近江グリフィンズ","男",1968,57,"OK","京都府"]
["ぐ１７","漆原","友里","グリフィンズ",null,"ぐ１７","漆原友里","東近江グリフィンズ","女",1992,33,"OK","彦根市"]
["ぐ１８","谷","優果","グリフィンズ",null,"ぐ１８","谷優果","東近江グリフィンズ","女",1997,28,"OK","三重県"]
["ぐ１９","西野","美恵","グリフィンズ",null,"ぐ１９","西野美恵","東近江グリフィンズ","女",1988,37,"OK","長浜市"]
["ぐ２０","鍵弥","初美","グリフィンズ",null,"ぐ２０","鍵弥初美","東近江グリフィンズ","女",1988,37,"OK","米原市"]
["ぐ２１","竹内","朝飛","グリフィンズ","Jr","ぐ２１","竹内朝飛","東近江グリフィンズ","男",2011,14,"OK","彦根市"]
["ぐ２２","原田","健汰","グリフィンズ","Jr","ぐ２２","原田健汰","東近江グリフィンズ","男",2011,14,"OK","米原市"]
["ぐ２３","小林","由汰","グリフィンズ",null,"ぐ２３","小林由汰","東近江グリフィンズ","男",1996,29,"OK","草津市"]
[null,7]
["し０１","杉山","春澄","県立大",null,"し０１",{"$f":"B178&C178","v":"杉山春澄"},"滋賀県立硬式テニス","男",2004,21,{"$f":"IF(G178=\"\",\"\",IF(COUNTIF($G$5:$G$354,G178)>1,\"2重登録\",\"OK\"))","v":"OK"},"彦根市"]
["し０２","吉田","薫平","県立大",null,"し０２","吉田薫平","滋賀県立硬式テニス","男",2001,24,"OK","彦根市"]
["し０３","山内","瑞生","県立大",null,"し０３",{"$f":"B180&C180","v":"山内瑞生"},"滋賀県立硬式テニス","男",2002,23,"OK","彦根市"]
["し０４","岩瀧","虹貴","県立大",null,"し０４",{"$f":"B181&C181","v":"岩瀧虹貴"},"滋賀県立硬式テニス","男",2005,20,"OK","彦根市"]
["し０５","太田","翔也","県立大",null,"し０５",{"$f":"B182&C182","v":"太田翔也"},"滋賀県立硬式テニス","男",2005,20,"OK","大阪府"]
["し０６","梶田","純平","県立大",null,"し０６","梶田純平","滋賀県立硬式テニス","男",2002,23,"OK","彦根市"]
["し０７","島田","蒼空","県立大",null,"し０７","島田蒼空","滋賀県立硬式テニス","男",2003,22,"OK","大阪府"]
["し０８","服部","紘樹","県立大",null,"し０８","服部紘樹","滋賀県立硬式テニス","男",2004,21,"OK","彦根市"]
["し０９","河越","琢真","県立大",null,"し０９","河越琢真","滋賀県立硬式テニス","男",2004,{"$f":"IF(J186=\"\",\"\",(2025-J186))","v":21},"OK","甲賀市"]
[null,8]
["ふ０１","水本","淳史","フレンズ",null,{"$f":"A188","v":"ふ０１"},{"$f":"B188&C188","v":"水本淳史"},"フレンズ","男",1967,58,{"$f":"IF(G188=\"\",\"\",IF(COUNTIF($G$5:$G$354,G188)>1,\"2重登録\",\"OK\"))","v":"OK"},"彦根市"]
["ふ０２","清水","善弘","フレンズ","ｓｅ","ふ０２","清水善弘","フレンズ","男",1952,73,{"$f":"IF(G189=\"\",\"\",IF(COUNTIF($G$5:$G$354,G189)>1,\"2重登録\",\"OK\"))","v":"OK"},"近江八幡市"]
["ふ０３","岡本","大樹","フレンズ",null,"ふ０３","岡本大樹","フレンズ","男",1982,43,{"$f":"IF(G190=\"\",\"\",IF(COUNTIF($G$5:$G$354,G190)>1,\"2重登録\",\"OK\"))","v":"OK"},"大津市"]
["ふ０４","増田","剛士","フレンズ",null,"ふ０４","増田剛士","フレンズ","男",1976,49,{"$f":"IF(G191=\"\",\"\",IF(COUNTIF($G$6:$G$367,G191)>1,\"2重登録\",\"OK\"))","v":"OK"},"彦根市"]
["ふ０５","成宮","康弘","フレンズ",null,"ふ０５","成宮康弘","フレンズ","男",1970,55,"OK","彦根市"]
["ふ０６","浦嶋","博邦","フレンズ",null,"ふ０６","浦嶋博邦","フレンズ","男",1977,48,"OK","東近江市"]
["ふ０７","平塚","  聡","フレンズ",null,"ふ０７","平塚  聡","フレンズ","男",1960,65,"OK","彦根市"]
["ふ０８","池端","誠治","フレンズ",null,"ふ０８","池端誠治","フレンズ","男",1972,53,"OK","彦根市"]
["ふ０９","三代","康成","フレンズ",null,"ふ０９","三代康成","フレンズ","男",1968,57,"OK","近江八幡市"]
["ふ１０","古市","卓志","フレンズ",null,"ふ１０","古市卓志","フレンズ","男",1974,51,{"$f":"IF(G197=\"\",\"\",IF(COUNTIF($G$4:$G$22,G197)>1,\"2重登録\",\"OK\"))","v":"OK"},"彦根市"]
["ふ１１","福元","公道","フレンズ",null,"ふ１１","福元公道","フレンズ","男",1949,76,"OK","大津市"]
["ふ１２","福元","さち","フレンズ",null,"ふ１２","福元さち","フレンズ","女",1971,54,"OK","大津市"]
["ふ１３","大野","美南","フレンズ",null,"ふ１３","大野美南","フレンズ","女",1993,32,"OK","湖南市"]
["ふ１４","三代","梨絵","フレンズ",null,"ふ１４","三代梨絵","フレンズ","女",1976,49,{"$f":"IF(G201=\"\",\"\",IF(COUNTIF($G$4:$G$22,G201)>1,\"2重登録\",\"OK\"))","v":"OK"},"近江八幡市"]
["ふ１５","栗田","智里","フレンズ",null,"ふ１５","栗田智里","フレンズ","女",1978,47,{"$f":"IF(G202=\"\",\"\",IF(COUNTIF($G$4:$G$22,G202)>1,\"2重登録\",\"OK\"))","v":"OK"},"愛荘町"]
["ふ１６","筒井","珠世","フレンズ",null,"ふ１６","筒井珠世","フレンズ","女",1967,58,"OK","米原市"]
["ふ１７","浦嶋",null,"フレンズ",null,"ふ１７","浦嶋公子","フレンズ","女",1967,58,"OK","東近江市"]
["ふ１８","柏木","貴子","フレンズ",null,"ふ１８","柏木貴子","フレンズ","女",1974,51,{"$f":"IF(G205=\"\",\"\",IF(COUNTIF($G$4:$G$22,G205)>1,\"2重登録\",\"OK\"))","v":"OK"},"栗東市"]
["ふ１９","出縄","久子","フレンズ",null,"ふ１９",{"$f":"B206&C206","v":"出縄久子"},"フレンズ","女",1965,60,{"$f":"IF(G206=\"\",\"\",IF(COUNTIF($G$4:$G$22,G206)>1,\"2重登録\",\"OK\"))","v":"OK"},"甲賀市"]
["ふ２０","吉岡","京子","フレンズ",null,"ふ２０","吉岡京子","フレンズ","女",1959,66,{"$f":"IF(G207=\"\",\"\",IF(COUNTIF($G$4:$G$22,G207)>1,\"2重登録\",\"OK\"))","v":"OK"},"愛荘町"]
["ふ２１","森","千代美","フレンズ",null,"ふ２１","森千代美","フレンズ","女",1958,67,{"$f":"IF(G208=\"\",\"\",IF(COUNTIF($G$4:$G$22,G208)>1,\"2重登録\",\"OK\"))","v":"OK"},"野洲市"]
[null,9]
["う０１","岩花","功","うさかめ",null,{"$f":"A210","v":"う０１"},{"$f":"B210&C210","v":"岩花功"},"うさぎとかめの集い","男",1962,63,{"$f":"IF(G210=\"\",\"\",IF(COUNTIF($G$8:$G$292,G210)>1,\"2重登録\",\"OK\"))","v":"OK"},"野洲市"]
["う０２","牛道","雄介","うさかめ",null,"う０２","牛道雄介","うさぎとかめの集い","男",1978,47,"OK","長浜市"]
["う０３","久保田","勉","うさかめ",null,"う０３","久保田勉","うさぎとかめの集い","男",1967,58,"OK","甲賀市"]
["う０４","小倉","俊郎","うさかめ",null,"う０４","小倉俊郎","うさぎとかめの集い","男",1959,66,"OK","湖南市"]
["う０５","垣内","義則","うさかめ",null,"う０５","垣内義則","うさぎとかめの集い","男",1972,53,"OK","近江八幡市"]
["う０６","片岡","一寿","うさかめ",null,"う０６","片岡一寿","うさぎとかめの集い","男",1971,54,"OK","湖南市"]
["う０７","亀井","皓太","うさかめ",null,"う０７","亀井皓太","うさぎとかめの集い","男",2003,22,"OK","近江八幡市"]
["う０８","亀井","雅嗣","うさかめ",null,"う０８","亀井雅嗣","うさぎとかめの集い","男",1970,55,"OK","近江八幡市"]
["う０９","𡈽山","悠","うさかめ",null,"う０９","𡈽山悠","うさぎとかめの集い","男",1988,37,"OK","大津市"]
["う１０","土肥","将博","うさかめ",null,"う１０","土肥将博","うさぎとかめの集い","男",1964,61,"OK","近江八幡市"]
["う１１","深田","健太郎","うさかめ",null,"う１１","深田健太郎","うさぎとかめの集い","男",1997,28,"OK","大津市"]
["う１２","松本","啓吾","うさかめ",null,"う１２","松本啓吾","うさぎとかめの集い","男",1981,44,"OK","彦根市"]
["う１３","森","健一","うさかめ",null,"う１３","森健一","うさぎとかめの集い","男",1971,54,"OK","湖南市"]
["う１４","森","皓輝","うさかめ",null,"う１４","森皓輝","うさぎとかめの集い","男",1998,27,"OK","東近江市"]
["う１５","山本","昌紀","うさかめ",null,"う１５","山本昌紀","うさぎとかめの集い","男",1970,55,"OK","野洲市"]
["う１６","山本","浩之","うさかめ",null,"う１６","山本浩之","うさぎとかめの集い","男",1967,58,"OK","野洲市"]
["う１７","吉村","淳","うさかめ",null,"う１７","吉村淳","うさぎとかめの集い","男",1976,49,"OK","栗東市"]
["う１８","脇野","佳邦","うさかめ",null,"う１８","脇野佳邦","うさぎとかめの集い","男",1973,52,"OK","近江八幡市"]
["う１９","中嶋","徹","うさかめ",null,"う１９","中嶋徹","うさぎとかめの集い","男",1986,39,"OK","日野町"]
["う２０","中田","富憲","うさかめ",null,"う２０","中田富憲","うさぎとかめの集い","男",1961,64,"OK","湖南市"]
["う２１","野村","良平","うさかめ",null,"う２１","野村良平","うさぎとかめの集い","男",1989,36,"OK","多賀町"]
["う２２","利光","龍司","うさかめ",null,"う２２","利光龍司","うさぎとかめの集い","男",1972,53,"OK","栗東市"]
["う２３","八木","篤司","うさかめ",null,"う２３","八木篤司","うさぎとかめの集い","男",1973,52,"OK","彦根市"]
["う２４","坂田","義記","うさかめ",null,"う２４","坂田義記","うさぎとかめの集い","男",1988,37,"OK","守山市"]
["う２５","村地","直也","うさかめ",null,"う２５","村地直也","うさぎとかめの集い","男",1989,36,"OK","東近江市"]
["う２６","中村","雅宣","うさかめ",null,"う２６","中村雅宣","うさぎとかめの集い","男",1978,47,"OK","東近江市"]
["う２７","織田","修輔","うさかめ",null,"う２７","織田修輔","うさぎとかめの集い","男",1987,38,"OK","兵庫県"]
["う２８","渡邊","直洋","うさかめ",null,"う２８","渡邊直洋","うさぎとかめの集い","男",1988,37,"OK","京都府"]
["う２９","猪師","崇人","うさかめ",null,"う２９","猪師崇人","うさぎとかめの集い","男",1985,40,"OK","京都府"]
["う３０","中島","章大","うさかめ",null,"う３０","中島章大","うさぎとかめの集い","男",1989,36,"OK","京都府"]
["う３１","徳光","亮真","うさかめ",null,"う３１","徳光亮真","うさぎとかめの集い","男",1990,35,"OK","大阪府"]
["う３２","元生","光亮","うさかめ",null,"う３２","元生光亮","うさぎとかめの集い","男",1990,35,"OK","京都府"]
["う３３","磯野","宏貴","うさかめ",null,"う３３","磯野宏貴","うさぎとかめの集い","男",1998,27,"OK","三重県"]
["う３４","神野","眞旗","うさかめ",null,"う３４","神野眞旗","うさぎとかめの集い","男",1997,28,"OK","三重県"]
["う３５","甲斐","祐一","うさかめ",null,"う３５","甲斐祐一","うさぎとかめの集い","男",1984,41,"OK","三重県"]
["う３６","阿部","智貴","うさかめ",null,"う３６","阿部智貴","うさぎとかめの集い","男",1994,31,"OK","三重県"]
["う３７","佐藤","和弘","うさかめ","ｓｅ","う３７","佐藤和弘","うさぎとかめの集い","男",1955,70,"OK","大津市"]
["う３８","永原","博司","うさかめ",null,"う３８",{"$f":"B247&C247","v":"永原博司"},"うさぎとかめの集い","男",1963,62,{"$f":"IF(G247=\"\",\"\",IF(COUNTIF($H$4:$H$305,G247)>1,\"2重登録\",\"OK\"))","v":"OK"},"東近江市"]
["う３９","田中","伸一","うさかめ",null,"う３９",{"$f":"B248&C248","v":"田中伸一"},"うさぎとかめの集い","男",1964,61,{"$f":"IF(G248=\"\",\"\",IF(COUNTIF($H$4:$H$305,G248)>1,\"2重登録\",\"OK\"))","v":"OK"},"米原市"]
["う４０","今井","順子","うさかめ",null,"う４０","今井順子","うさぎとかめの集い","女",1957,68,{"$f":"IF(G249=\"\",\"\",IF(COUNTIF($G$8:$G$292,G249)>1,\"2重登録\",\"OK\"))","v":"OK"},"東近江市"]
["う４１","伊吹","邦子","うさかめ",null,"う４１","伊吹邦子","うさぎとかめの集い","女",1969,56,"OK","彦根市"]
["う４２","植垣","貴美子","うさかめ",null,"う４２","植垣貴美子","うさぎとかめの集い","女",1965,60,"OK","大津市"]
["う４３","牛道","心","うさかめ",null,"う４３","牛道心","うさぎとかめの集い","女",1978,47,"OK","長浜市"]
["う４４","梅田","陽子","うさかめ",null,"う４４","梅田陽子","うさぎとかめの集い","女",1969,{"$f":"IF(J253=\"\",\"\",(2025-J253))","v":56},"OK","湖南市"]
["う４５","垣内","美香","うさかめ",null,"う４５","垣内美香","うさぎとかめの集い","女",1968,57,"OK","近江八幡市"]
["う４６","川瀬","清子","うさかめ",null,"う４６","川瀬清子","うさぎとかめの集い","女",1968,57,"OK","東近江市"]
["う４７","辻","佳子","うさかめ",null,"う４７","辻佳子","うさぎとかめの集い","女",1973,52,"OK","彦根市"]
["う４８","苗村","直子","うさかめ",null,"う４８","苗村直子","うさぎとかめの集い","女",1974,51,"OK","竜王町"]
["う４９","藤田","博美","うさかめ",null,"う４９","藤田博美","うさぎとかめの集い","女",1970,55,"OK","彦根市"]
["う５０","三崎","奈々","うさかめ",null,"う５０","三崎奈々","うさぎとかめの集い","女",1973,52,"OK","近江八幡市"]
["う５１","竹下","光代","うさかめ",null,"う５１","竹下光代","うさぎとかめの集い","女",1974,51,"OK","東近江市"]
["う５２","姫井","亜利沙","うさかめ",null,"う５２","姫井亜利沙","うさぎとかめの集い","女",1982,43,"OK","彦根市"]
["う５３","村田","彩子","うさかめ",null,"う５３","村田彩子","うさぎとかめの集い","女",1968,57,"OK","近江八幡市"]
["う５４","村川","庸子","うさかめ",null,"う５４","村川庸子","うさぎとかめの集い","女",1969,56,"OK","愛知郡"]
["う５５","永原","佳代子","うさかめ",null,"う５５","永原佳代子","うさぎとかめの集い","女",1967,58,"OK","東近江市"]
["う５６","永原","実佳","うさかめ",null,"う５６","永原実佳","うさぎとかめの集い","女",1997,28,"OK","東近江市"]
["う５７","古株","淳子","うさかめ",null,"う５７","古株淳子","うさぎとかめの集い","女",1968,57,"OK","近江八幡市"]
["う５８","小梶","優子","うさかめ",null,"う５８","小梶優子","うさぎとかめの集い","女",1974,51,"OK","東近江市"]
[null,10]
["ぷ０１","吉田","知司","プラチナＴＣ","ｓｅ",{"$f":"A269","v":"ぷ０１"},"吉田知司","プラチナＴＣ","男",1948,77,{"$f":"IF(G269=\"\",\"\",IF(COUNTIF($G$8:$G$292,G269)>1,\"2重登録\",\"OK\"))","v":"OK"},"東近江市"]
["ぷ０２","一丸","征功","プラチナＴＣ",null,"ぷ０２","一丸征功","プラチナＴＣ","男",1960,65,"OK","近江八幡"]
["ぷ０３","西村","国太郎","プラチナＴＣ","ｓｅ","ぷ０３","西村国太郎","プラチナＴＣ","男",1942,83,"OK","東近江市"]
["ぷ０４","南","人嗣","プラチナＴＣ","ｓｅ","ぷ０４","南人嗣","プラチナＴＣ","男",1955,70,"OK","愛荘町"]
["ぷ０５","田中","勝之","プラチナＴＣ","ｓｅ","ぷ０５","田中勝之","プラチナＴＣ","男",1944,81,"OK","東近江市"]
["ぷ０６","加藤","昇","プラチナＴＣ","ｓｅ","ぷ０６",{"$f":"B274&C274","v":"加藤昇"},"プラチナＴＣ","男",1952,73,"OK","東近江市"]
["ぷ０７","木瀬","茂雄","プラチナＴＣ",null,"ぷ０７","木瀬茂雄","プラチナＴＣ","男",1958,67,"OK","東近江市"]
["ぷ０８","大木","浩","プラチナＴＣ",null,"ぷ０８","大木浩","プラチナＴＣ","男",1963,62,"OK","東近江市"]
["ぷ０９","竹中","徳司","プラチナＴＣ","ｓｅ","ぷ０９","竹中徳司","プラチナＴＣ","男",1955,70,"OK","東近江市"]
["ぷ１０","新谷","弘之","プラチナＴＣ","ｓｅ","ぷ１０","新谷弘之","プラチナＴＣ","男",1951,74,"OK","犬上郡"]
["ぷ１１","今村","宣明","プラチナＴＣ","ｓｅ","ぷ１１","今村宣明","プラチナＴＣ","男",1951,74,"OK","近江八幡"]
["ぷ１２","平岩","治司","プラチナＴＣ","ｓｅ","ぷ１２","平岩治司","プラチナＴＣ","男",1955,70,"OK","東近江市"]
["ぷ１３","福島","直樹","プラチナＴＣ","ｓｅ","ぷ１３","福島直樹","プラチナＴＣ","男",1951,74,"OK","東近江市"]
["ぷ１４","藤野","秀明","プラチナＴＣ","ｓｅ","ぷ１４","藤野秀明","プラチナＴＣ","男",1947,78,"OK","犬上郡"]
["ぷ１５","小林","明子","プラチナＴＣ","ｓｅ","ぷ１５","小林明子","プラチナＴＣ","女",1955,70,"OK","東近江市"]
["ぷ１６","ドーラン","デーブ","プラチナＴＣ",null,"ぷ１６","ドーランデーブ","プラチナＴＣ","男",1963,62,"OK","東近江市"]
["ぷ１７","井田","圭子","プラチナＴＣ","ｓｅ","ぷ１７","井田圭子","プラチナＴＣ","女",1951,74,"OK","東近江市"]
["ぷ１８","前田","喜久子","プラチナＴＣ","ｓｅ","ぷ１８","前田喜久子","プラチナＴＣ","女",1945,80,"OK","彦根市"]
["ぷ１９","鈴木","英夫","プラチナＴＣ","ｓｅ","ぷ１９","鈴木英夫","プラチナＴＣ","男",1955,70,"OK","東近江市"]
["ぷ２０","堀部","品子","プラチナＴＣ",null,"ぷ２０","堀部品子","プラチナＴＣ","女",1951,74,"OK","東近江市"]
[null,11]
["こ０１","澤村","博司","個人登録",null,{"$f":"A290","v":"こ０１"},{"$f":"B290&C290","v":"澤村博司"},"個人登録","男",1971,{"$f":"IF(J290=\"\",\"\",(2025-J290))","v":54},"OK","甲賀市"]
["こ０２","谷本","健人","個人登録",null,{"$f":"A291","v":"こ０２"},"谷本健人","個人登録","男",1967,58,"OK","草津市"]

{"sheet":"歴代入賞者","index":3,"n_rows":49,"n_cols":27,"rows_kept":49,"cut":false,"hidden":false,"merged":[[0,1,0,15]]}
[null,"東近江カップ歴代成績"]
[]
[null,null,"東近江市","東近江市","東近江市","東近江市","東近江市","東近江市","東近江市","東近江市","東近江市","東近江市","東近江市第１０回","東近江市","東近江市","東近江市","東近江市","東近江市","東近江市","東近江市","東近江市","東近江市","八日市市","八日市市","八日市市","八日市市","八日市市"]
[null,null,"第20回大会2023年","第19回大会2023年","第18回大会2022年","第17回大会2021年","第16回大会2020年","第15回大会2019年","第14回大会2018年","第13回大会2017年","第12回大会2016年","第11回大会2015年","記念大会2014年","第9回大会2013年","第８回大会2012年","第7回大会2011年","第６回大会2010年","第５回大会2009年","第４回大会2008年","第３回大会2007年","第2回大会2006年","第１回大会2005年","第５回大会2004年","第４回大会2003年","第3回大会2002年","第2回大会2001年","第１回大会2000年"]
[null,null,"2024.7.7","2023.7.9","2022.7.10","2021.7.7",null,null,"2018.7.8","2017.7.9","2016.7.10","2015.7.12","2014.7.13","2013.7.21","2012.7.1","2011.7.3","2010.7.4","2009.7.5","2008.6.28"]
[null,"優勝","うさかめ（強）","うさかめクロス","うさかめクロス","MTT",null,null,"チームＪＵＮＫＯ","チームＪＵＮＫＯ","チーム　ゆとり","グリフィンズＡ","ふれふれ坊主","ＫテニスカレッジＡ","ＫテニスカレッジＡ","ＫテニスカレッジＡ","ＫテニスカレッジＡ","錦","ＫテニスカレッジＡ","錦","錦","イナマーズ","イナマーズ","ＫテニスカレッジＡ","ＫテニスカレッジＡ","いい夫婦友の会","村田製作所連合軍"]
[null,null,"林哲学","竹田　圭佑","竹田　圭佑","吉野　淳也",null,null,"藤井正和","藤井正和","吉野　淳也","北村　健","三代　康成","川並　和之","川並　和之","川並　和之","川並　和之","中田　冨憲","川並　和之","中田　冨憲","中田　冨憲","川上　英二","稲泉　聡","川並　和之","　永里　裕次","青井　　亘","名田　一茂"]
[null,null,"小林一成","松本啓吾","松本啓吾","本多　勇輝",null,null,"武藤幸宏","武藤幸宏","岩渕　光紀","岡本大樹","辻　義規","山口　真彦","山口　真彦","山口　真彦","山口　直彦","川上　英二","坪田　真嘉","池端　誠治","池端　誠治","稲泉　聡","川上　英二","高瀬　英彦","　植松　靖之","岡川　謙二","岡川　謙二"]
[null,null,"井口瑛心","川上悠作","新谷　良","新谷　良","コロナのため中止","コロナのため中止","小出周平","小出周平","浅田恵壱","浦崎康平","成宮　康弘","坪田　真嘉","坪田　真嘉","坪田　真嘉","坪田　真嘉","稲泉　聡","村地　直也","川上　英二","川上　英二","川本　純也","澤村　博司","山口　直彦","　山口　直彦","名田　一茂","甲斐下　仁平"]
[null,null,"中村香澄","山田雅子","大野　美南","池尻　陽香",null,null,"岩崎順子","岩崎順子","國近なつ美","福島麻公","三代　梨絵","田中　和枝","田中　和枝","田中　和枝","田中　和枝","入江　晶子","田中　和枝","白根　和栄　","田中　都","今井　順子","今井　順子","田中　和枝","　高田貴代美","青井美恵子","名田　育子"]
[null,null,"佐口珠穂","山田歩奈","山田歩奈","松村　明香",null,null,"和田桃子","和田桃子","小倉　菜奈","寒出麻奈未","土肥　祐子","石原　はる美","石原　はる美","石原　はる美","石原　はる美","松田 順子","石原　はる美","入江　晶子","入江　晶子","入江　晶子","田中　一美","　高田　貴代美","　村田　由子","岡川　恭子","岡川　恭子"]
[null,null,"山田歩奈","浅野木奈子","高野麻由","山脇　聖菜",null,null,"藤岡美智子","藤岡美智子","津田悠花","三崎真依","近藤　直美","　永松　貴子","浅野木奈子","　永松　貴子","　永松　貴子","今井　順子","　近藤　直美","今井　順子","今井　順子","中村　晃代","佐藤　由美子","松山　遥","　近藤　直美","名田　育子","甲斐下　治美"]
[null,"準優勝","よせあつめ","アンヴァース","UP STAR☆","うさかめクロス",null,null,"しおんとクワガタ","ＫテニスカレッジＳ","グリフィンズＡ","チーム　ユトリ","ドラゴンレッド","Ｋテニスカレッジα","ひろみんず","Bambi","錦","Ｋテニスカレッジ","錦","ＫテニスカレッジＡ","ＫテニスカレッジＡ","ＫテニスカレッジＡ","ＫテニスカレッジＡ","夫婦Ｄｅテニス","チームＬＩＮＥＳ","安土ＴＣ.１","今井チーム"]
[null,null,"吉野淳也","上津慶和","辻雅晃","林　哲学",null,null,"西口正剛","吉野　淳也","北村　健","吉野　純也","中田　冨憲","山口直彦","浅田　洋史","三代　康成","稲泉　聡","川並　和之","中田　冨憲","川並　和之","川並　和之","川並　和之","川並　和之","　青井　　亘","　竹村　　治","大林　　久","大林　久"]
[null,null,"祝出優介","松村友喜","天井正","牛道　雄介",null,null,"今津大二郎","岩渕　光紀","井ノ口幹也","岩渕　光紀","川上　英二","永里祐次","小菅　真一","辻　義規","中田　冨憲","坪田　真嘉","佐藤　和弘","坪田　真嘉","坪田　真嘉","坪田　真嘉","高瀬　英彦","　岡川　謙二","　中村　隆昭","藤田　　論","鈴木　英夫"]
[null,null,"吉村優","寺元翔太","中村亘","竹田　圭佑","コロナのため中止","コロナのため中止","山形祐樹","中西泰輝","遠池建介","浅田洋史","西内　友也","竹村　治","辻　義規","山崎　正雄","佐藤　和弘","村地　直也","西内　友也","宮村　知宏","難波　道弘","竹村　治","長谷出　浩","　名田　一茂","　山口信一郎","塩田　浩二","寺田　昌登"]
[null,null,"漆原友里","片桐美里","野村香織","永松　貴子",null,null,"真田千春","東　恵","山本あづさ","稲継　馨","田中　由紀","山口美由希","伊吹　邦子","三代　梨絵","今井　順子","田中　和枝","白根　和栄　","田中　和枝","田中　和枝","近藤　直美","河口　佳代子","　青井美恵子","　甲斐　好美","今井　順子","今井　順子"]
[null,null,"村上陽香","植田早耶","齋藤好見","岡野　羽",null,null,"吉田恵里","田中瑞萌","佐々木恵子","小倉　菜奈","中村　晃代","川端文子","藤田　博美","土肥　祐子","松田 順子","石原　はる美","松田　順子","近藤　直美","石原　はる美","田中　和枝","　高田　貴代美","日比　正子","　山根　孝恵","小財","塩田　佳子"]
[null,null,"平山亜紀","西野美恵","天井真未","大野　美南",null,null,"浜口彩加","中島嬉子","福島麻公","迫田　成美","今井　順子","酒井直美","三崎　真依","金沢　優子","浅田　祥子","　梶木　和子","今井　順子","児玉　朋子","松山　遥","石原　はる美","近藤　直美","　名田　育子","　仙波佳代子","平野志津子","早川　多喜子"]
[null,"３位","ジャスティス山形","スパイシーズ","うさぎとかめの集い","グリフィンズ",null,null,"ふれふれ坊主","チームなかた","チームＪＵＮＫＯ","ＫテニスカレッジＡ","ＫテニスカレッジＡ","グリフィンズＡ","コリラックマ","ひろみんず","ＫテニスカレッジB","マリナーズ","ＫテニスカレッジB","ひこニャンズ","ひろみんズ","ＪＡＣＫ＆Ｂｅｔｔｙ","ＫテニスカレッジＢ","イナマーズ","夫婦Ｄｅテニス","ＫテニスカレッジＡ","愛知郡ＴＣＢ"]
[null,null,"吉田正剛","清野宏樹","山本浩之","漆原　大介",null,null,"三代康成","中田富憲","藤井正和","川並　和之","川並　和之","北村　健","古市　卓志","佐野　望","水本　敦史","内田　亮","小笠原　光雄","辻　義規","馬場　昭真","　青井　　亘","坂元　智成","稲泉　聡","　青井　　亘","川並　和之","関　弘次"]
[null,null,"木本和寿","本田賢二郎","稲葉大知","鍵谷　浩太",null,null,"金谷太郎","久保暉暉","武藤幸宏","永里　裕次","永里　裕次","岡本大樹","西川　昌一","小菅　真一","宮嶋　利弘","小菅　真一","宮嶋　利弘","古市　卓志","小菅　真一","杉山 邦夫","多田　章三","川上　英二","　岡川　謙二","多田　章三","山川　利章"]
[null,null,"山形祐樹","福島悠太","伊串大介","上津　慶和","コロナのため中止","コロナのため中止","成宮康弘","諌山航平","小出周平","山口　直彦","坪田　真嘉","浦崎康平","松本　啓吾","岡本　大樹","村地　直也","井ノ口　尚人","宮村　知宏","高瀬　英彦","荻野　義之","　岡川　謙二","坪田　真嘉","杉本　龍平","　名田　一茂","坪田　真嘉","清水　英秦"]
[null,null,"吉田恵里","堅田端木","藤田博美","漆原　友里",null,null,"三代梨絵","今井順子","岩崎順子","田中　和枝","田中　和枝","福島麻公","藤原　泰子","伊吹　邦子","浅田　亜祐子","藤田　博美","小笠原　容子","川端　文子","折岡　育子","　青井美恵子","小笠原　容子","湊","　青井美恵子","田中　和枝","飯尾　貴子"]
[null,null,"真田千春","真継早紀子","牛道心","植田　早耶",null,null,"木村美香","日高眞規子","森田千暁","　永松　貴子","石原　はる美","寒出麻奈未","木村　美香","藤田　博美","梶木　和子","橋本　真理","吉岡　京子","藤原　泰子","藤田　博美","　名田　育子","伊勢加奈子","大橋","　岡川　恭子","高田貴代美","甲斐　好美"]
[null,null,"梅田ひかり","佐藤彩香","村木貴子","鍵弥　初美",null,null,"筒井珠世","河野由子","藤岡美智子","山口美由希","　永松　貴子","三崎真依","佐竹　昌子","三崎　真依","伊吹　邦子","野村　良美","児玉　朋子","佐竹　昌子","金沢　優子","　岡川　恭子","石原　はる美","田中　一美","　名田　育子","村田　由子","中村　恭子"]
[]
[null,null,"ＯＶ３５０","ＯＶ３３０","OV３００","OV３００"]
[null,"優勝","ゴローズ","ペガサス","グリーンアップル","グリーンアップル"]
[null,null,"杉山邦夫","平塚聡","池端誠治","三代　康成"]
[null,null,"中田富憲","川上英二","成宮　康弘","成宮　康弘"]
[null,null,"辰巳悟朗","成宮康弘","古市　卓志","古市　卓志"]
[null,null,"永松貴子","筒井珠世","三代　梨絵","三代　梨絵"]
[null,null,"田中有紀","辻佳子","筒井　珠世","筒井　珠世"]
[null,null,"川上美弥子","竹下光代","土肥　裕子","土肥　裕子"]
[null,"準優勝","NEXT","ゴローズ","エール","NEXT"]
[null,null,"森寿人","東正隆","三代　康成","山田広美"]
[null,null,"福元公道","辰巳悟朗","水元淳史","山本　浩之"]
[null,null,"山田広実","木村喜和","辻義規","森　寿人"]
[null,null,"山口千恵","永松貴子","伊吹邦子","山口　登紀子"]
[null,null,"福元さち","川上美弥子","辻佳子","黒坂　晶子"]
[null,null,"谷口敬子","山田美樹","竹下光代","山口　千恵"]
[null,"３位","フレンズプラス","ワッキーズ","NEXT","クリティカルヒット"]
[null,null,"水本淳史","脇野佳邦","山田広美","杉山　邦夫"]
[null,null,"成宮康弘","岡本洋一","牛道雄介","辻　義規"]
[null,null,"馬場康弘","鈴木英夫","森　寿人","水元　淳史"]
[null,null,"筒井珠世","伊吹邦子","山口　登紀子","田中　有紀"]
[null,null,"出縄久子","松井美和子","黒坂　晶子","竹下　光代"]
[null,null,"藤原泰子","本池清子","山口　千恵","辻　佳子"]